{"text_format":"1","workbook":"xlsx","n_sheets":19,"sheets":["Menu","Instructions","Changes","Elect","Va","DA","SR","Oper","600","2K","3K 10K","4K","5K 6K","8K","9K","3W-2000","3T31-3L32","3T33-3L34","3T37-3L38"],"not_rendered":{"charts":2,"images":1,"macros":1,"external_links":0,"defined_names":79,"comments":4,"pivot_tables":0},"unopened":[],"bounds":{"document_bytes":16777216,"sheet_cells":100000,"rows_first":2000,"rows_last":500,"rows_between":2000,"halvings":0,"cell_chars":16384,"cell_head_chars":4096},"cells_cut":0,"cells_raw":0,"read":"whole","date_system":"1900"}

{"sheet":"Menu","index":0,"n_rows":82,"n_cols":20,"rows_kept":82,"cut":false,"hidden":false,"merged":[[23,7,24,7],[23,8,24,8],[59,1,64,8],[11,16,12,16],[11,17,12,17],[41,10,41,11],[39,10,39,11],[27,13,27,15],[12,10,12,11],[13,10,13,11],[44,5,44,6],[19,1,19,17],[35,1,35,2],[27,10,27,11],[28,10,28,11],[43,5,43,6],[42,5,42,6],[41,5,41,6],[4,5,4,6],[19,19,19,23],[39,7,40,7],[13,12,14,17],[17,1,17,17],[39,8,40,8],[39,1,39,2],[27,1,27,2],[28,1,28,2],[39,4,39,6],[39,3,40,3],[28,4,28,6],[27,4,27,6],[40,5,40,6],[33,19,41,22],[41,13,41,15],[42,10,42,11],[42,13,42,15],[3,19,3,20],[4,19,4,20],[5,19,5,20],[12,19,18,21],[28,13,28,15],[4,12,4,15],[8,16,9,17],[8,12,9,15],[10,16,10,17],[23,17,24,17],[23,16,24,16]]}
[null,null,null,null,null,null,null,null,"   Marwin Ball Valve Actuator Sizing Program"]
[null,null,null,null,null,null,null,null,"      Disclaimer on Top of Instructions Page",null,null,null,null,null,null,null,null,"Version 6.1"]
[]
[null,"Valve Selection",null,null,{"$f":"IF(Size=\"--\",\"       Select Valid Size\",\"\")","v":""},null,null,{"$f":"IF(AND(Seat=\"--\",Series<>\"Own\"),\"    Select Valid Seat Mat'l\",IF(AND(Seat=\"--\",Series=\"Own\"),\"Select Soft or Hard Seat Mat'l\",\"\"))","v":""}]
[null,null,"Series",null,null,"     Size",null,"           Seat Material",null,null,null,null,"         Service Factor (SF)(2)"]
[]
[]
[]
{"$rows_left_out":75}
{"sheet":"Instructions","index":1,"n_rows":116,"n_cols":11,"rows_kept":116,"cut":false,"hidden":false,"merged":[[1,7,2,10],[91,0,91,2],[91,3,91,10],[95,3,95,10],[96,7,96,8],[96,9,96,10],[96,3,96,4],[96,5,96,6]]}
[]
[null,null,null,null,null,null,null,"Marwin Ball Valve\nActuator Sizing Program"]
[]
[null,null,null,null,null,null,null,null,null,null,"Version 6.1"]
[]
["This program selects the Marwin actuator size for Marwin ball valves based on torque stated.  It is not"]
["intended to indicate availability or ability to mount actuator to valve.  While this program is presented in good"]
["faith and believed to be reasonably accurate, Marwin Valve, a division of Richards Industrials, makes no"]
{"$rows_left_out":109}
{"sheet":"Changes","index":2,"n_rows":232,"n_cols":3,"rows_kept":232,"cut":false,"hidden":true,"merged":[[4,2,4,3]]}
["Release and Change History"]
[]
["Version 1",null,"Initial Release"]
["2001-08-13"]
[]
["Version 2",null,"Errors corrected--2000R, 0.25 3000F, 0.25 7000F, 0.25 10000F."]
["2001-10-08",null,"3000 & 10000 PEEK seat torques reduced by 50% (service factor of 2 removed) to be consistent with other torques."]
[null,null,"10000 sizes and torques corrected."]
{"$rows_left_out":225}
{"sheet":"Elect","index":3,"n_rows":49,"n_cols":20,"rows_kept":49,"cut":false,"hidden":true,"merged":[[46,0,46,1],[46,2,46,4],[3,17,4,17],[3,18,3,19],[4,2,4,4],[4,0,4,1],[27,0,27,1],[27,2,27,4],[4,8,5,8],[27,8,28,8],[3,14,5,14],[3,15,4,15],[3,16,4,16]]}
["Electric Actuator"]
[]
[null,null,null,null,null,null,"Elect_Act"]
["Electric Act. Data Table (Table 5A)",null,null,null,null,null,"A6:I22",null,null,null,null,null,null,null,"Model Number","ER","Torque","Cycle Time","Mounting"]
["Torque Range",null,"Electric Actuator",null,null,"Act. >=",null,null,"Cycle Time, s",null,"Elect Actuator Version",null,null,null,null,null,null,null,"Blt Ptrn","Stem"]
["Min","Max","Model No.","Indelac ID","lbf-in.","Va. Open","Mounting","Stem Connect.",null,null,null,"Menu",null,null,null,null,"(In-Lbs.)","(Sec/90)","ISO or in.","mm"]
[101,200,"ER-2","SD",200,{"$f":"AND(E7>=SOT)","v":true},"F05","14mm Female Star",5,null,1,"ER",null,null,"SD or SR","ER2",200,5,"F03/F05/F07 (SD Reg)","14 Female Star"]
[201,300,"ER-3","SDX",300,true,"F05","14mm Female Star",5,null,2,"ES, AS, or ASC Fail Safe Spr Rtn",null,null,"SDX or SX","ER3",300,5,"F03/F05/F07 (SD Reg)","14 Female Star"]
{"$rows_left_out":42}
{"sheet":"Va","index":4,"n_rows":84,"n_cols":62,"rows_kept":84,"cut":false,"hidden":true,"merged":[[2,26,3,26],[2,43,3,43],[26,2,26,4],[27,2,27,4],[30,2,30,4],[10,2,10,4],[11,2,11,4],[12,2,12,4],[13,2,13,4],[31,2,31,4],[32,2,32,4],[34,2,34,4],[18,2,18,4],[19,2,19,4],[28,2,28,4],[20,2,20,4],[21,2,21,4],[29,2,29,4],[22,2,22,4],[23,2,23,4],[24,2,24,4],[25,2,25,4],[33,2,33,4],[41,2,41,4],[35,2,35,4],[37,2,37,4],[38,2,38,4],[39,2,39,4],[36,2,36,4],[1,51,1,61],[4,31,5,31],[45,2,45,4],[2,23,3,23],[3,2,3,4],[4,2,4,4],[5,2,5,4],[6,2,6,4],[7,2,7,4],[8,2,8,4],[9,2,9,4],[14,2,14,4],[15,2,15,4],[16,2,16,4],[17,2,17,4],[40,2,40,4]]}
["Valve Control"]
["Marwin Valve Series Menu (Table1)",null,null,null,null,null,null,null,null,null,null,null,null,"Series",null,null,null,null,null,null,null,null,null,null,null,null,null,null,null,null,null,null,null,null,null,null,null,null,null,null,null,null,null,null,null,null,null,null,null,null,null,"Series"]
[null,"Menu","Description",null,null,"Sizes","Seats","No. Col's",null,null,null,null,null,"7000F","666F","666R",null,"4600F","9000F",null,"3T3100F","MS3000","DM600F","3L_or_3T\n_2100F_F",null,null,"3L_or_3T\n_3900F","8700F",null,"3000F",null,"3000R","CF8000F","2000F_150",null,"5800F","5000F",null,"5800R","5000R","2000R_150",null,"2000F_300","3L_or_3T_2S33F","3L9000R",9700,null,null,null,null,null,"3000R","7000R","DR8000F","666R","8000R","2000R_150","4700F","10000F","MS3000",9700,"Own"]
[1,"*****2-Way********","***************************************************************************",null,null,"*****************","************","*************",null,null,null,null,null,null,null,"7000R",null,"3L8000F",null,"4600R","3L3200F","10000F","8000R",null,null,null,null,"9000R",null,"4600R",null,"4700F","KF8900F",null,null,"6800F","6000F",null,"6800R","6000R",null,null,null,null,null,null,null,null,null,null,null,"3000F","7000F",null,"666F","8000F","2000F_150","5000R",null,"MS10000"]
[2,"666R","2-Pc Brass Reduced Port, 600 WOG",null,null,".5 - 2","T","4",null,null,null,null,null,null,"DR8000F","8700F",null,null,null,null,null,"MS10000","8000F",null,null,null,null,"DM9000F",null,null,null,"3L_or_3T\n_2100F_A","CF8901F",null,null,null,null,null,null,null,null,null,null,null,null,null,null,null,null,null,null,null,null,null,"DM600F","9000R","2000F_300","5000F"]
[3,"666F","2-Pc Brass Full Port, 600 WOG",null,null,".25 - 2","T","4",null,null,null,null,null,null,null,"9000R",null,null,null,null,null,null,null,null,null,null,null,null,null,null,null,null,null,null,null,null,"5801F",null,null,null,null,"5801R",null,null,null,null,null,null,null,null,null,null,null,null,"4600R","9000F","3L_or_3T_2100F","5800R"]
[4,"DM600F","2-Pc Full Port, Direct Mount, 600 WOG",null,null,".25 - 4","T","4",null,null,null,null,null,null,"3T3300R","DM9000F",null,null,null,null,null,null,null,null,null,null,null,null,null,null,null,null,null,null,null,null,"6801F",null,null,null,null,null,null,null,null,null,null,null,null,null,null,null,null,null,"4600F",null,"3L_or_3T_2S33F","5800F"]
[5,"2000R_150","FE Uni-body, Reduced Port, FE 150",null,null,"1-4, no 1.25, 2.5","R, S, U","4",null,null,null,null,null,null,"3L3400R",null,null,null,null,null,null,null,null,null,null,null,null,null,null,null,null,null,null,null,null,null,null,null,null,null,null,null,null,null,null,null,null,null,null,null,null,null,null,null,"CF8000F",null,null,"6000R"]
{"$rows_left_out":77}
{"sheet":"DA","index":5,"n_rows":56,"n_cols":33,"rows_kept":56,"cut":false,"hidden":true,"merged":[[4,2,4,14],[42,2,42,14],[4,0,4,1],[35,27,35,28],[36,27,36,28],[37,27,37,28],[42,0,42,1],[4,18,4,19],[15,18,15,19],[42,18,42,19]]}
["Direct Acting Pnuematic Actuator"]
[]
[null,null,null,null,null,null,null,"DA_Pneu_Act",null,"This table not valid; data removed, but 1st and last lines left to maintain program functionality for future alternate actuator."]
["D. A. Pneumatic Act. Data Table (Table 6A)",null,null,null,null,null,null,"A7:P10",null,null,null,null,null,null,null,null,null,null,null,null,null,null,"D. A. Press. Sel. Menu (Table 9)",null,null,null,null,"Actuator Version"]
["Torque Range",null,"Pneumatic Actuator Torque Information - Double Acting (lbf-in.)",null,null,null,null,null,null,null,null,null,null,null,null,"Act. >=","Mount","Stem","Cycle Time, s",null,"Lookup",null,null,"Menu",null,null,null,null,"Menu"]
["Min","Max","Model No.","Valbia ID","Size Ord.","40 PSI","50 PSI","60 PSI","70 PSI","80 PSI","90 PSI","100 PSI","115 PSI","130 PSI","140 psi","Va. Open",null,"Sq.","CCW","CW","Row No.",null,1,"40 PSI",null,null,null,1,"Old / Unchanged UT"]
[{"$f":"B6+1","v":{"$error":"#VALUE!"}},{"$f":"HLOOKUP($X$17,$C$6:$O$10,U7,FALSE)","v":209.1},"UT-0-DA","DA 52",2,104.5,130.69999999999999,156.80000000000001,182.9,209.1,235.2,261.3,300.5,339.7,365.8,{"$f":"AND(B7>=SOT)","v":true},"F03/F05",11,null,null,2,null,2,"50 PSI",null,null,null,2,"New UT"]
[0,{"$f":"HLOOKUP($X$17,$C$6:$O$10,U8,FALSE)","v":25469},"UT-7-DA","DA 270",11,12734,15919,19097,22284,25469,28654,31832,36611,41382,44565,{"$f":"AND(B8>=SOT)","v":true},"F16",46,null,null,3,null,3,"60 PSI",null,null,null,3,"Automatic"]
{"$rows_left_out":49}
{"sheet":"SR","index":6,"n_rows":153,"n_cols":70,"rows_kept":153,"cut":false,"hidden":true,"merged":[[49,39,49,40],[9,39,9,40],[132,19,132,20],[132,21,132,22],[51,45,51,46],[26,45,26,46],[3,51,3,59],[4,51,4,59],[43,51,43,59],[44,51,44,59],[11,45,11,46],[8,25,8,29],[9,21,9,22],[131,32,132,32],[8,30,8,34],[67,45,67,46],[132,23,132,24],[48,25,48,29],[48,30,48,34],[131,26,131,27],[131,29,131,31],[8,2,8,24],[9,9,9,10],[132,17,132,18],[132,7,132,8],[132,9,132,10],[132,11,132,12],[49,11,49,12],[49,21,49,22],[49,13,49,14],[49,23,49,24],[49,15,49,16],[49,17,49,18],[49,19,49,20],[132,13,132,14],[132,15,132,16],[8,0,8,1],[48,2,48,24],[9,7,9,8],[48,0,48,1],[9,13,9,14],[9,11,9,12],[9,23,9,24],[9,15,9,16],[9,17,9,18],[9,19,9,20],[131,0,131,1],[131,2,131,24],[49,7,49,8],[49,9,49,10]]}
["Spring Return Pneumatic Actuator"]
[]
[null,null,null,null,null,null,null,null,null,null,null,null,null,null,null,null,null,null,null,null,null,null,null,null,null,null,null,null,null,null,null,null,null,null,null,"All FC > Req","All FO > Req",null,null,null,null,null,null,"Valve Start (Break) Open Torque  -->  Start Open from Closed Position"]
[null,null,null,null,null,null,null,null,null,null,null,null,null,null,null,null,null,null,null,null,null,null,null,null,null,null,null,null,null,null,null,null,null,null,null,"Spr. Start >=","Spr. Start >=",null,null,null,null,null,null,"Valve End Open Torque --> End Open from Closed Position",null,null,null,null,null,null,null,"Fail Safe Spring Return Pneumatic Actuator",null,null,null,null,null,null,null,null,null,null,null,"S. R. Pneumatic Act. Press.",null,null,null,null,"S. R. Pneumatic Act. Failure"]
[null,null,null,null,null,null,null,null,null,null,null,null,null,null,null,null,null,null,null,null,null,null,null,null,null,null,null,null,null,null,null,null,null,null,null,"Start Closed","Start Open",null,null,null,null,null,null,"Valve Start Closed Torque --> Start Closed from Open Position",null,null,null,null,null,null,null,{"$f":"BB28","v":"Torque vs. Va. Position -- Fail Closed"},null,null,null,null,null,null,null,null,null,null,null,"Sel. Menu (Table 10)",null,null,null,null,"Mode Menu (Table 11)"]
[null,null,null,null,null,null,null,null,null,null,null,null,null,null,null,null,null,null,null,null,null,null,null,null,null,null,null,null,null,null,null,null,null,null,null,"Spr. End >=","Spr. End >=",null,null,null,null,null,null,"Valve End Closed Torque --> End Closed from Open Position",null,null,null,null,null,null,null,null,null,null,null,null,null,null,null,null,null,null,null,null,"Menu"]
[null,null,null,null,null,null,null,null,null,"FS_Pneu_Act",null,"This table not valid; data removed, but 1st and last lines left to maintain program functionality for future alternate actuator.",null,null,null,null,null,null,null,null,null,null,null,null,null,null,null,null,null,null,null,null,null,null,null,"End Closed","End Open",null,null,null,null,null,null,null,null,null,null,null,null,null,null,null,null,null,null,null,null,null,null,null,null,null,null,1,"40 PSI",null,null,null,1,"Fail Closed"]
["Old Spring Return Pneumatic Act. Data Table (Table 7A)",null,null,null,null,null,null,null,null,"A12:AA67",null,null,"Old SR Pneumatic Act.",null,null,null,null,null,null,null,null,null,null,null,null,null,"Old SR Pneumatic Act.",null,null,null,null,null,null,null,null,"Air Start >=","Air Start >=",null,null,null,null,null,null,null,null,null,null,null,null,null,null,null,null,null,null,null,null,null,null,null,null,null,null,2,"50 PSI",null,null,null,2,"Fail Open"]
{"$rows_left_out":146}
{"sheet":"Oper","index":7,"n_rows":142,"n_cols":50,"rows_kept":142,"cut":false,"hidden":true,"merged":[[106,37,111,39],[127,37,132,39],[5,37,10,39],[26,37,31,39],[45,37,50,39],[73,37,78,39],[88,37,94,39],[10,49,10,52],[11,49,11,52],[12,49,12,52],[6,49,6,52],[7,49,7,52],[8,49,8,52],[9,49,9,52],[43,12,43,24],[43,25,43,29],[13,49,13,52],[14,49,14,52],[24,30,24,31],[15,49,15,52],[17,49,17,52],[18,49,18,52],[24,32,25,32],[71,30,71,31],[86,30,86,31],[125,30,125,31],[24,6,24,8],[24,9,24,10],[86,25,86,29],[43,6,43,8],[43,9,43,10],[24,25,24,29],[86,12,86,24],[86,6,86,8],[86,9,86,10],[125,6,125,8],[125,9,125,10],[125,12,125,24],[125,25,125,29],[3,6,3,8],[3,9,3,10],[3,30,3,31],[3,25,3,29],[104,12,104,24],[104,25,104,29],[3,12,3,24],[104,6,104,8],[104,9,104,10],[71,6,71,8],[71,9,71,10],[24,12,24,24],[71,12,71,24],[71,25,71,29],[43,30,43,31],[104,30,104,31],[125,33,126,33],[3,32,4,32],[71,32,72,32],[86,32,87,32],[104,32,105,32],[71,33,72,33],[86,33,87,33],[43,33,44,33],[43,32,44,32]]}
["Gear Operator"]
["Gear_Op_Alecto",null,null,null,null,null,"Gear_Op_Alecto"]
["Alecto Gear Operator Data Table (Table 13A)",null,null,null,null,null,"A6:AG17"]
[null,null,null,null,null,null,"Std. Handwheel",null,null,"Largest HW",null,null,"Handwheel Diameters Available, In.",null,null,null,null,null,null,null,null,null,null,null,null,"Handwheel Dia.",null,null,null,null,"Handwheel Pull",null,"All Criteria Met",null,null,"Alecto Max. HW Dia. Sel. Menu (Table 14A)"]
["Marwin No. (Relative Cost)","AT Controls No.","Gear Ratio","Mech.\nAdvan-\ntage","*Std. Torque Output\nIn-lbf","Max Torque Output\nIn-lbf","Std.\nHW Dia.\nIn.","Tot. HW\nPull @ Std Torque\nLbf","Tot. HW\nPull @ Max Torq.\nLbf","Largest HW Dia.\nIn.","Tot. HW Pull @ Max Torq.\nLbf","HW Shaft Dia",1,2,3,4,5,6,7,8,9,10,11,12,null,"Va. Torq. <= Oper. Max. Output Torque","Calc. D. for User Max Pull,\nIn.","Index No. of Next Largest Avail. HW","Next Larg-\nest Avail. HW D.\nIn.","<= Max Allow. Dia","Tot. Pull, Lbf","<= Max Pull",null,null,null,null,"HW Dia","Alecto GO Description:",null,null,null,"Gear Operator Mfgr Menu",null,null,null,null,null,"Gear Operator Note Table"]
[1,"AB 210",30,9.6999999999999993,2328,2920,6,{"$f":"E6/(G6/2*D6)","v":80},{"$f":"F6/(G6/2*D6)","v":100.34364261168386},8,{"$f":"F6/(D6*J6/2)","v":75.257731958762889},0.59,0,6,8,"NA","NA","NA","NA","NA","NA","NA","NA","NA","NA",{"$f":"IF(SOT<=F6,\"Y\",\"N\")","v":"Y"},{"$f":"2*SOT/(Menu!$P$38*D6)","v":0.29639175257731959},{"$f":"IF(OR(AA6=6,AA6=8),MATCH(AA6,M6:Y6),MATCH(AA6,M6:Y6)+1)","v":2},{"$f":"CHOOSE(AB6,$M6,$N6,$O6,$P6,$Q6,$R6,$S6,$T6,$U6,$V6,$W6,$X6,$Y6)","v":6},{"$f":"IF(AC6<=$AK$141,\"Y\",\"N\")","v":"Y"},{"$f":"SOT/($AK$141/2*D6)","v":1.3172966781214204},{"$f":"IF(AE6<=Menu!$P$38,\"Y\",\"N\")","v":"Y"},{"$f":"AND(Z6=\"Y\",AD6=\"Y\",AF6=\"Y\")","v":true},null,null,1,6,"Quarter turn worm gear operator for manual valves.",null,null,null,null,"Menu",null,null,null,null,null,"Series","Note"]
[2,"AB 550",34,9.6999999999999993,3880,8270,10,80,170.51546391752578,20,85.257731958762889,0.79,0,10,12,14,16,18,20,24,28,"NA","NA","NA","NA","Y",{"$f":"2*SOT/(Menu!$P$38*D7)","v":0.29639175257731959},{"$f":"IF(OR(AA7=10,AA7=12,AA7=14,AA7=16,AA7=18,AA7=20,AA7=24,AA7=28),MATCH(AA7,M7:Y7),MATCH(AA7,M7:Y7)+1)","v":2},10,"Y",1.3172966781214204,{"$f":"IF(AE7<=Menu!$P$38,\"Y\",\"N\")","v":"Y"},true,null,null,2,8,null,null,null,null,1,"DynaTorque DT (Manual)",null,null,null,null,1,"Q200","Q200 not suitiable for chain wheel."]
[3,"AB 880",38,12.3,5904,14350,12,79.999999999999986,194.44444444444443,30,77.777777777777771,0.79,0,10,12,14,16,18,20,24,28,30,32,"NA","NA","Y",{"$f":"2*SOT/(Menu!$P$38*D8)","v":0.23373983739837398},{"$f":"IF(OR(AA8=10,AA8=12,AA8=14,AA8=16,AA8=18,AA8=20,AA8=24,AA8=28,AA8=30,AA8=32),MATCH(AA8,M8:Y8),MATCH(AA8,M8:Y8)+1)","v":2},10,"Y",1.0388437217705511,{"$f":"IF(AE8<=Menu!$P$38,\"Y\",\"N\")","v":"Y"},true,null,null,3,10,null,null,null,null,2,"DynaTorque DT-SD (Declutch.--DA)",null,null,null,null,2,"Q400","Q400 not suitiable for chain wheel."]
{"$rows_left_out":135}
{"sheet":"600","index":8,"n_rows":50,"n_cols":12,"rows_kept":50,"cut":false,"hidden":true,"merged":[[3,9,3,11],[22,9,22,11],[36,9,36,11],[36,1,36,4],[3,1,3,4],[22,1,22,4],[36,5,36,8],[3,5,3,8],[22,5,22,8]]}
[]
[]
["DM600F Series Full Port Direct Mount",null,null,null,"_DM600F","Press =",{"$f":"Press","v":1500},"psi"]
[null,"Torque (Break), lbf-in.",null,null,null,"Max. Seat Pressure",null,null,null,"Mounting"]
[null,"Teflon","RPTFE","Delrin","PEEK","T","R","D","P","Mount","Blt Ptrn","Sq"]
["Size           Col.",2,3,4,5,6,7,8,9,10,11,12]
["0.25",10,"--","--","--","NA","--","--","--","Direct","F03",9]
["0.38",10,"--","--","--","NA","--","--","--","Direct","F03",9]
{"$rows_left_out":43}
{"sheet":"2K","index":9,"n_rows":52,"n_cols":17,"rows_kept":52,"cut":false,"hidden":true,"merged":[[3,9,3,11],[18,9,18,11],[38,9,38,11],[18,1,18,4],[3,1,3,4],[38,1,38,4],[3,5,3,8],[18,5,18,8],[38,5,38,8]]}
[]
[]
["2000R-150 Series Reduced Port",null,null,null,"_2000R_150",{"$f":"Press","v":1500},"psi"]
[null,"Torque (Break), lbf-in.",null,null,null,"Max. Seat Pressure",null,null,null,"Mounting"]
[null,"Teflon","RPTFE","CRPTFE","UHMW-PE","T","R","S","U","Mount","Blt Ptrn","Sq",null,null,"UHMW-PE",null,"PTFE"]
["Size           Col.",2,3,4,5,6,7,8,9,10,11,12,null,null,"1.15 RPTFE",null,"0.9 RPTFE"]
["1.00",{"$f":"0.9*$C7","v":99},{"$f":"IF(Press<=100,90,110)","v":110},{"$f":"1.15*$C7","v":126.49999999999999},126.49999999999999,285,285,285,285,"Bckt & Cplgr","F04",6.3,null,null,{"$f":"1.15*$C7","v":126.49999999999999},null,{"$f":"0.9*$C7","v":99}]
["1.50",{"$f":"0.9*$C8","v":198},{"$f":"IF(Press<=100,180,220)","v":220},252.99999999999997,252.99999999999997,285,285,285,285,"Bckt & Cplgr","F05",8,null,null,{"$f":"1.15*$C8","v":252.99999999999997},null,{"$f":"0.9*$C8","v":198}]
{"$rows_left_out":45}
{"sheet":"3K 10K","index":10,"n_rows":106,"n_cols":22,"rows_kept":106,"cut":false,"hidden":true,"merged":[[3,15,3,17],[23,15,23,17],[47,15,47,17],[90,1,90,7],[71,1,71,7],[90,8,90,14],[90,16,90,17],[71,16,71,17],[71,8,71,14],[3,1,3,7],[23,1,23,7],[47,1,47,7],[3,8,3,14],[47,8,47,14],[23,8,23,14]]}
["Press =",{"$f":"Press","v":1500}]
[]
["3000R Series Reduced Port",null,null,null,"_3000R",null,null,null,"Press =",{"$f":"Press","v":1500},"psi"]
[null,"Torque, lbf-in.",null,null,null,null,null,null,"Max. Seat Pressure",null,null,null,null,null,null,"Mounting"]
[null,"Teflon","RPTFE","CRPTFE","UHMW-PE","Delrin","PEEK","CPEEK","T","R","S","U","D","P","CP","Mount","Blt Ptrn","Sq",null,"UHMW_PE"]
["Size           Col.",2,3,4,5,6,7,8,9,10,11,12,13,14,15,10,11,12,null,"1.5 PTFE"]
["--"]
["--"]
{"$rows_left_out":99}
{"sheet":"4K","index":11,"n_rows":39,"n_cols":12,"rows_kept":39,"cut":false,"hidden":true,"merged":[[3,1,3,4],[21,1,21,4],[3,5,3,8],[21,5,21,8],[3,9,3,11],[21,9,21,11]]}
[]
[]
["4600R Series Reduced Port",null,null,null,"_4000R"]
[null,"Torque (Break), lbf-in.",null,null,null,"Max. Seat Pressure",null,null,null,"Mounting"]
[null,"Teflon","RPTFE","Delrin","PEEK","T","R","D","P","Mount","Blt Ptrn","Sq"]
["Size           Col.",2,3,4,5,6,7,8,9,10,11,12]
["0.25",{"$f":"IF(Press<=100,45,65)","v":65},"--","--","--",600,"NA","NA","NA","--","--","--"]
["0.38",{"$f":"IF(Press<=100,45,65)","v":65},"--","--","--",600,"NA","NA","NA","--","--","--"]
{"$rows_left_out":32}
{"sheet":"5K 6K","index":12,"n_rows":158,"n_cols":18,"rows_kept":158,"cut":false,"hidden":true,"merged":[[121,6,121,10],[141,6,141,10],[81,6,81,10],[101,6,101,10],[81,11,81,13],[101,11,101,13],[121,11,121,13],[141,11,141,13],[40,6,40,10],[58,6,58,10],[3,6,3,10],[21,6,21,10],[3,11,3,13],[21,11,21,13],[40,11,40,13],[58,11,58,13],[121,1,121,5],[141,1,141,5],[3,1,3,5],[21,1,21,5],[40,1,40,5],[58,1,58,5],[81,1,81,5],[101,1,101,5]]}
[]
[]
["5000R Series Reduced Port",null,null,null,"_5000R",null,"Press =",{"$f":"Press","v":1500},"psi"]
[null,"Torque, lbf-in.",null,null,null,null,"Max. Seat Pressure",null,null,null,null,"Mounting"]
[null,"Teflon","RPTFE","CRPTFE","UHMW-PE","P","T","R","S","U","P","Mount","Blt Ptrn","Sq",null,null,null,"UHMW-PE"]
["Size           Col.",2,3,4,5,6,7,8,9,10,11,10,11,12,null,null,null,"1.3 PTFE"]
["0.50",{"$f":"0.85*C7","v":305.44749999999999},{"$f":"IF(Press<=100,60,0.0001*Press^2 +0.0529*Press + 55)","v":359.35},{"$f":"1.1*C7","v":395.28500000000008},{"$f":"1.3*$B7","v":397.08175},"--",285,285,285,285,"--","Bckt & Cplgr","Spl",5,null,null,null,{"$f":"1.3*$B7","v":397.08175}]
["0.75",305.44749999999999,{"$f":"IF(Press<=100,60,0.0001*Press^2 + 0.0529*Press + 55)","v":359.35},395.28500000000008,{"$f":"1.3*$B8","v":397.08175},"--",285,285,285,285,"--","Bckt & Cplgr","Spl",5,null,null,null,{"$f":"1.3*$B8","v":397.08175}]
{"$rows_left_out":151}
{"sheet":"8K","index":13,"n_rows":66,"n_cols":16,"rows_kept":66,"cut":false,"hidden":true,"merged":[[49,6,49,10],[28,6,28,10],[28,1,28,5],[49,1,49,5],[3,11,3,13],[3,1,3,5],[3,6,3,10],[28,11,28,13],[49,11,49,13]]}
[]
[]
["CF8901F Series Full (Tube) Port",null,null,null,"_CF8901F",null,"Press =",{"$f":"Press","v":1500},"psi"]
[null,"Torque (Break), lbf-in.",null,null,null,null,"Max. Seat Pressure",null,null,null,null,"Mounting"]
[null,"Teflon","RPTFE","Delrin","UHMW-PE","PEEK","T","R","D","U","P","Mount","Blt Ptrn","Sq",null,"Teflon"]
["Size           Col.",2,3,4,5,6,7,8,9,10,11,12,13,14,null,2]
["0.50",80,"--","--","--","--","NA","--","--","--","--","Bckt & Cplgr","F03",9,null,89]
["0.75",100,"--","--","--","--","NA","--","--","--","--","Bckt & Cplgr","F03",9,null,142]
{"$rows_left_out":59}
{"sheet":"9K","index":14,"n_rows":72,"n_cols":18,"rows_kept":72,"cut":false,"hidden":true,"merged":[[38,16,39,16],[38,17,39,17],[57,1,57,4],[57,5,57,8],[57,9,57,11],[3,9,3,11],[18,9,18,11],[37,9,37,11],[18,5,18,8],[3,1,3,4],[18,1,18,4],[37,1,37,4],[3,5,3,8],[37,5,37,8]]}
[]
[]
["9000R Series Reduced Port",null,null,null,"_9000R"]
[null,"Torque (Break), lbf-in.",null,null,null,"Max. Seat Pressure",null,null,null,"Mounting"]
[null,"T","RPTFE","D","P","T","R","D","P","Mount","Blt Ptrn","Sq"]
["Size           Col.",2,3,4,5,6,7,8,9,10,11,12]
["0.50","--",60,"--","--","--","NA","--","--","Bckt & Cplgr","Spl",5.21]
["0.75","--",85,"--","--","--","NA","--","--","Bckt & Cplgr","Spl",6.2]
{"$rows_left_out":65}
{"sheet":"3W-2000","index":15,"n_rows":38,"n_cols":14,"rows_kept":38,"cut":false,"hidden":true,"merged":[[23,1,23,4],[3,1,3,4],[3,5,3,8],[23,5,23,8],[3,9,3,11],[23,9,23,11]]}
[]
[]
["3L/T-2100 Series Full Port Thd End Float Ball (Bolted End Pc)",null,null,null,null,null,"_3L_or_3T_2100F_A",null,null,"Press =",{"$f":"Press","v":1500},"psi"]
[null,"Torque (Break), lbf-in.",null,null,null,"Max. Seat Pressure",null,null,null,"Mounting",null,null,null,"3W-2P/Q33"]
[null,"Teflon","RPTFE","CRPTFE","UHMW-PE","T","R","S","U","Mount","Blt Ptrn","Sq",null,"RPTFE"]
["Size           Col.",2,3,4,5,6,7,8,9,10,11,12,null,3]
["0.38","--",95,{"$f":"1.15*$C7","v":109.24999999999999},{"$f":"1.15*$C7","v":109.24999999999999},"--","NA","NA","NA","--","--","--",null,95]
["0.50","--",{"$f":"IF(Press<=285, 147,206)","v":206},{"$f":"1.15*$C8","v":236.89999999999998},236.89999999999998,"--",740,"NA","NA","Direct","F04",9,null,150]
{"$rows_left_out":31}
{"sheet":"3T31-3L32","index":16,"n_rows":20,"n_cols":15,"rows_kept":20,"cut":false,"hidden":true,"merged":[[3,1,3,4],[3,5,3,8],[3,9,3,11]]}
[]
[]
["3T3101 or 3L3201 Series Full Port",null,null,"_3T3101F","_3L3201F"]
[null,"Torque (Break), lbf-in.",null,null,null,"Max. Seat Pressure",null,null,null,"Mounting"]
[null,"Teflon","RPTFE","Delrin","PEEK","T","R","D","P","Mount","Blt Ptrn","Sq",null,null,"New Dsgn"]
["Size           Col.",2,3,4,5,6,7,8,9,10,11,12,null,null,"TFE*"]
["0.25",18,"--","--","--","NA","--","--","--","Direct","F03",9,null,null,71]
["0.38",18,"--","--","--","NA","--","--","--","Direct","F03",9,null,null,71]
{"$rows_left_out":13}
{"sheet":"3T33-3L34","index":17,"n_rows":18,"n_cols":12,"rows_kept":18,"cut":false,"hidden":true,"merged":[[3,1,3,4],[3,5,3,8],[3,9,3,11]]}
[]
[]
["3T3300 and 3L3400 Series Reduced Port",null,null,null,null,"_3T3300R   _3L3400R"]
[null,"Torque (Break), lbf-in.",null,null,null,"Max. Seat Pressure",null,null,null,"Mounting"]
[null,"Teflon","RPTFE","Delrin","PEEK","T","R","D","P","Mount","Blt Ptrn","Sq"]
["Size           Col.",2,3,4,5,6,7,8,9,10,11,12]
["0.25","--",53.1,"--","--","--","NA","--","--","Direct","F03",9]
["0.38","--",53.1,"--","--","--","NA","--","--","Direct","F03",9]
{"$rows_left_out":11}
{"sheet":"3T37-3L38","index":18,"n_rows":18,"n_cols":12,"rows_kept":18,"cut":false,"hidden":true,"merged":[[3,1,3,4],[3,5,3,8],[3,9,3,11]]}
[]
[]
["3T3700 and 3L3800 Series Standard (Reduced) Port",null,null,null,null,"_3T3700R   _3L3800R"]
[null,"Torque (Break), lbf-in.",null,null,null,"Max. Seat Pressure",null,null,null,"Mounting"]
[null,"Teflon","RPTFE","Delrin","PEEK","T","R","D","P","Mount","Blt Ptrn","Sq"]
["Size           Col.",2,3,4,5,6,7,8,9,10,11,12]
["0.25",93,93,"--","--","NA","NA","--","--","Bckt & Cplgr","F04",9]
["0.38",93,93,"--","--","NA","NA","--","--","Bckt & Cplgr","F04",9]
{"$rows_left_out":10}