{"text_format":"1","workbook":"xlsx","n_sheets":19,"sheets":["Menu","Instructions","Changes","Elect","Va","DA","SR","Oper","600","2K","3K 10K","4K","5K 6K","8K","9K","3W-2000","3T31-3L32","3T33-3L34","3T37-3L38"],"not_rendered":{"charts":2,"images":1,"macros":1,"external_links":0,"defined_names":79,"comments":4,"pivot_tables":0},"unopened":[],"bounds":{"document_bytes":16777216,"sheet_cells":100000,"rows_first":2000,"rows_last":500,"rows_between":2000,"halvings":0,"cell_chars":16384,"cell_head_chars":4096},"cells_cut":0,"cells_raw":0,"read":"whole","date_system":"1900"}

{"sheet":"Menu","index":0,"n_rows":82,"n_cols":20,"rows_kept":82,"cut":false,"hidden":false,"merged":[[23,7,24,7],[23,8,24,8],[59,1,64,8],[11,16,12,16],[11,17,12,17],[41,10,41,11],[39,10,39,11],[27,13,27,15],[12,10,12,11],[13,10,13,11],[44,5,44,6],[19,1,19,17],[35,1,35,2],[27,10,27,11],[28,10,28,11],[43,5,43,6],[42,5,42,6],[41,5,41,6],[4,5,4,6],[19,19,19,23],[39,7,40,7],[13,12,14,17],[17,1,17,17],[39,8,40,8],[39,1,39,2],[27,1,27,2],[28,1,28,2],[39,4,39,6],[39,3,40,3],[28,4,28,6],[27,4,27,6],[40,5,40,6],[33,19,41,22],[41,13,41,15],[42,10,42,11],[42,13,42,15],[3,19,3,20],[4,19,4,20],[5,19,5,20],[12,19,18,21],[28,13,28,15],[4,12,4,15],[8,16,9,17],[8,12,9,15],[10,16,10,17],[23,17,24,17],[23,16,24,16]]}
[null,null,null,null,null,null,null,null,"   Marwin Ball Valve Actuator Sizing Program"]
[null,null,null,null,null,null,null,null,"      Disclaimer on Top of Instructions Page",null,null,null,null,null,null,null,null,"Version 6.1"]
[]
[null,"Valve Selection",null,null,{"$f":"IF(Size=\"--\",\"       Select Valid Size\",\"\")","v":""},null,null,{"$f":"IF(AND(Seat=\"--\",Series<>\"Own\"),\"    Select Valid Seat Mat'l\",IF(AND(Seat=\"--\",Series=\"Own\"),\"Select Soft or Hard Seat Mat'l\",\"\"))","v":""}]
[null,null,"Series",null,null,"     Size",null,"           Seat Material",null,null,null,null,"         Service Factor (SF)(2)"]
[]
[]
[]
[null,null,null,"Series Description: ",{"$f":"Va!C46","v":"3-Pc Fire Safe, Full Port, 3000 WOG"},null,null,null,null,null,null,null,{"$f":"IF(ISNA(WOG),\"\",IF(Press>WOG,\"Incorrect Pressure\",\"\"))","v":""},null,null,null,"Mounting"]
[]
[null,null,null,null,null,null,null,null,null,{"$f":"IF(ISNA(WOG),\"\",IF(AND(OR(WOG=\"NA\",WOG=\"--\"), Series<>\"Own\"),\"\",IF(Series=\"Own\", \"Valve Torque =  \", \"Diff. Press. Across Va. =  \")))","v":""},1500,{"$f":"IF(ISNA(WOG),\"\",IF(AND(OR(WOG=\"NA\",WOG=\"--\"), Series<>\"Own\"),\"\",IF(Series=\"Own\", \"in-lb\", \"psi\")))","v":""},{"$f":"IF(ISNA(WOG),\"\",IF(OR(WOG=\"NA\",WOG=\"--\"),\" \",\"Enter 0 to \"&WOG&\" psi\"))","v":" "},null,null,null,{"$f":"IF(Va!D69<>0,Va!D69,\"\")","v":"Bckt & Cplgr"}]
[null,null,null,null,null,null,null,null,null,null,null,null,null,null,null,null,{"$f":"IF(Va!D70<>0,Va!D70,\"\")","v":"F03"},{"$f":"IF(Va!D70<>0,Va!D71,\"\")","v":5.44}]
[null,null,null,null,null,null,null,null,null,"Valve Torque1 (Start Open Torque) =  ",{"$f":"IF(OR(Size=\"--\",Seat=\"--\",Torq=\"Not Available\",Press>WOG),\"\",Torq)","v":96},null,{"$f":"IF(AND(Size=\"--\",Seat=\"--\",Series<>\"Own\"),\"Invalid Size and Seat Material\",IF(AND(Size=\"--\",Series<>\"Own\"),\"Invalid Size\",IF(Seat=\"--\",\"Invalid Seat Material\",IF(Va!D62=\"Not Available\",\"Consult Engineering\",IF(Press>WOG,\"\",\"\")))))","v":""},null,null,null,null,null,null,{"$f":"IF(OR(Seat=\"PEEK\", Seat=\"CPEEK\"), \"WARNING!  Torq. for PEEK & CPEEK seats especially sensitive to Diff. Press.  Enter correct Press.\",\"\")","v":""}]
[null,null,null,null,null,null,null,null,null,"Required Torque2 (Valve Torque  X  SF) =  ",{"$f":"IF(OR(Size=\"--\",Seat=\"--\",Press>WOG, Torq=\"Not Available\"),\"\",SOT)","v":115},null,{"$f":"IF(K14>99999, \"Actuator selection invalid for required torque greater than 99999 in-lb.\", \"\")","v":""}]
[]
[null,{"$f":"Va!N60","v":""}]
[]
[null,"RATIO OF ACT. TO VA. TORQUE (EXCLUDING SERVICE FACTOR) SHOULD USUALLY BE 1.2 OR GREATER FOR AUTOMATION"]
[]
[null,"PRESS CALCULATE BUTTON  AFTER CHANGING ANY ENTRY."]
[]
[null,"Electric Actuator",null,null,null,null,null,null,null,null,"Double Acting Rack & Pinion Pneumatic Actuator"]
[]
[null,"Act. =",null,null,null,null,null,"Mtg","Time",null,null,null,null,"D. A. Act. Press. =  ",null,null,"Mtg","Time\nCCW/CW"]
[]
[null,null,null,null,"Elect Act.  Size =  ",{"$f":"IF(K14<99999,Elect!C49,\"Out of Range\")","v":"ER-2"},null,{"$f":"Elect!G49","v":"F05"},{"$f":"Elect!I49&\"s\"","v":"5s"},null,null,null,null,"D. A. Act. Size =  ",{"$f":"IF(K14<99999,DA!C45,\"Out of Range\")","v":"UT-0-DA"},null,{"$f":"DA!Q45","v":"F03/F05"},{"$f":"CONCATENATE(DA!S45,\"s\")","v":"0.07s"}]
[null,null,null,null,null,null,null,{"$f":"Elect!H49","v":"14mm Female Star"},null,null,null,null,null,null,null,null,{"$f":"DA!R45","v":11},{"$f":"CONCATENATE(DA!T45,\"s\")","v":"0.05s"}]
[null,"Act. Torque",null,null,"Required Torque2",null,null,"Act:Req4","Status",null,"Act. Torque",null,null,"Required Torque2",null,null,"Act:Req4","Status"]
[null,{"$f":"IF(OR(Elect!E7=99999,K14>99999),\"\",Elect!E7)","v":200},null,{"$f":"IF(B29=\"\",\"\",IF(B29>=E29,\"≥\",\"<\"))","v":"≥"},{"$f":"K14","v":115},null,null,{"$f":"IF(B29=\"\",\"\",B29/E29)","v":1.7391304347826086},{"$f":"IF(B29=\"\",\"\",IF(B29>=E29,\"OK\",\"Not OK\"))","v":"OK"},null,{"$f":"IF(OR(DA!B45=99999, K14>99999),\"\",DA!B45)","v":179},null,{"$f":"IF(K29=\"\",\"\",IF(K29>=N29,\"≥\",\"<\"))","v":"≥"},{"$f":"K14","v":115},null,null,{"$f":"IF(K29=\"\",\"\",K29/N29)","v":1.5565217391304347},{"$f":"IF(K29=\"\",\"\",IF(K29>=N29,\"OK\",\"Not OK\"))","v":"OK"}]
[null,{"$f":"IF(B29=\"\",\"\",IF(Va!X45<1, Va!$Y$50,Va!AG50))","v":"Act.:Req. Torque = 1.74 > 1.0 OK for Automation (Note 4)"},null,null,null,null,null,null,null,null,{"$f":"IF(K29=\"\",\"\",IF(Va!Y45<1, Va!$Y$51,Va!AG51))","v":"Act.:Req. Torque = 1.56 > 1.0 OK for Automation (Note 4)"}]
[null,{"$f":"IF(Elect!K11=2,\"Elect. Operation both Dir. Norm.; S. R. on Emer. loss of Elect. only.\",\"\")","v":""},null,null,null,null,null,null,null,null,{"$f":"IF(LEFT(Va!$C$46,5)=\"3-Way\",\"UT act. not suitiable for 3-way va's. in 180 deg. port config.\",\"\")","v":""}]
[]
[]
[null,"Spring Return Rack and Pinion Pneumatic Actuator",null,null,null,null,null,null,null,null,"Gear Operator",null,null,null,null,null,null,null,null,{"$f":"Oper!AL128","v":"Quarter turn worm gear operator for manual valves."}]
[]
[null,"Act. Press. =",null,null,null,null,"Fail Mode =",null,null,null,null,null,null,null,"Max. Allow. HW Dia. =",null,null,"in."]
[]
[null,null,null,null,"S. R. Act. Size =  ",{"$f":"IF(K14<99999,SR!C135,\"Out of Range\")","v":"UT-1-SR-05"},null,{"$f":"SR!AA143","v":"F05/F07"},{"$f":"CONCATENATE(SR!AN52,\"s\")","v":"0.13s"},null,null,null,null,null,"Max. Allow. Tot. HW Pull  =",80,null,"lbf"]
[null,null,{"$f":"SR!AA153","v":""},null,null,null,null,{"$f":"SR!AB143","v":14},{"$f":"CONCATENATE(SR!AO52,\"s\")","v":"0.13s"}]
[null,"for Actuator",null,null,"for Valve2",null,null,"Act : Req\nTorq4","Status",null,"Oper. = ",null,null,null,null,null,"Size =",{"$f":"IF(K14<99999,Oper!B128,\"Out of Range\")","v":"DT3"}]
[null,"Stroke","Act Torq",null,"Req Torq","Stroke6",null,null,null,null,null,null,null,null,null,{"$f":"Oper!AH128","v":"0.38-16 on 3.25 BC"}]
[null,"Spr. Start",{"$f":"IF(OR(SR!AB134=99999, K14>99999),\"\",SR!AB134)","v":196},{"$f":"IF(C42=\"\",\"\",IF(C42>=E42,\"≥\",\"<\"))","v":"≥"},{"$f":"CHOOSE(SR!$BQ$10,SCT,SOT)","v":104},{"$f":"CHOOSE(SR!$BQ$10,\"Start Closed\",\"Start Open\")","v":"Start Closed"},null,{"$f":"IF(C42=\"\",\"\",C42/E42)","v":1.8846153846153846},{"$f":"IF(C42=\"\",\"\",IF(C42>=E42,\"OK\",\"Not OK\"))","v":"OK"},null,"Oper. Torque",null,null,"Required Torque2",null,null,"Act:Req4","Status"]
[null,"Spr. End",{"$f":"IF(OR(SR!AB135=99999,K14>99999),\"\",SR!AB135)","v":111},{"$f":"IF(C43=\"\",\"\",IF(C43>=E43,\"≥\",\"<\"))","v":"≥"},{"$f":"CHOOSE(SR!$BQ$10,ECT,EOT)","v":98},{"$f":"CHOOSE(SR!$BQ$10,\"End Closed\",\"End Open\")","v":"End Closed"},null,{"$f":"IF(C43=\"\",\"\",C43/E43)","v":1.1326530612244898},{"$f":"IF(C43=\"\",\"\",IF(C43>=E43,\"OK\",\"Not OK\"))","v":"OK"},null,{"$f":"IF(OR(Oper!F128=99999,K14>99999),\"\",Oper!F128)","v":4500},{"$f":"Oper!#REF!","v":{"$error":"#REF!"}},{"$f":"IF(K43=\"\",\"\",IF(K43>=N43,\"≥\",\"<\"))","v":"≥"},{"$f":"IF(Oper!AP14=3,SOT+SR!AB135,SOT)","v":115},null,null,{"$f":"IF(K43=\"\",\"\",K43/N43)","v":39.130434782608695},{"$f":"IF(K43=\"\",\"\",IF(K43>=N43,\"OK\",\"Not OK\"))","v":"OK"}]
[null,"Air Start",{"$f":"IF(OR(SR!AB136=99999,K14>99999),\"\",SR!AB136)","v":193},{"$f":"IF(C44=\"\",\"\",IF(C44>=E44,\"≥\",\"<\"))","v":"≥"},{"$f":"CHOOSE(SR!$BQ$10,SOT,SCT)","v":115},{"$f":"CHOOSE(SR!$BQ$10,\"Start Open\",\"Start Closed\")","v":"Start Open"},null,{"$f":"IF(C44=\"\",\"\",C44/E44)","v":1.6782608695652175},{"$f":"IF(C44=\"\",\"\",IF(C44>=E44,\"OK\",\"Not OK\"))","v":"OK"},null,null,null,null,null,"Handwheel Dia. =",{"$f":"IF(Oper!AC128=0,\"\",Oper!AC128)","v":6},"in."]
[null,"Air End",{"$f":"IF(OR(SR!AB137=99999,K14>99999),\"\",SR!AB137)","v":95},{"$f":"IF(C45=\"\",\"\",IF(C45>=E45,\"≥\",\"<\"))","v":"≥"},{"$f":"CHOOSE(SR!$BQ$10,EOT,ECT)","v":92},{"$f":"CHOOSE(SR!$BQ$10,\"End Open\",\"End Closed\")","v":"End Open"},null,{"$f":"IF(C45=\"\",\"\",C45/E45)","v":1.0326086956521738},{"$f":"IF(C45=\"\",\"\",IF(C45>=E45,\"OK\",\"Not OK\"))","v":"OK"},null,null,null,null,null,"Tot. Handwheel Pull =",{"$f":"IF(Oper!AC128=0,\"\",SOT/(Oper!AC128/2*Oper!D128))","v":4.7325102880658445},"lbf"]
[null,{"$f":"IF(C42=\"\",\"\",IF(MIN(Va!Z45:Z48)<1, Va!$Y$52,Va!AG52))","v":"Act.:Req. Torque = 1.03 > 1.0 OK for Automation (Note 4)"},null,null,null,null,null,null,null,null,null,null,null,null,"No. of Handwheel Turns (90o) =",{"$f":"IF(Oper!AC128=0,\"\",Oper!C128*0.25)","v":7.5},"turns"]
[null,{"$f":"IF(LEFT(Va!$C$46,5)=\"3-Way\",\"UT act. not suit. for 3-way va's. in 180 deg. port config.\",\"\")","v":""},null,null,null,null,null,null,null,null,{"$f":"Oper!AX19","v":"DT3 not suitiable for chain wheel."}]
[]
[null,"Notes:"]
[null,"1. Valve Torque does not includes service factor (SF).",null,null,null,null,null,null,null,null,"5. Valve & actuator mounting information (bolt pattern & stem) and"]
[null,null,null,null,null,null,null,null,null,null,"    nominal operating times (seconds, CCW/CW) shown in lavender."]
[null,"2. Required Torque includes service factor.  Recommended SF's are:"]
[null,"  Clean, & 10 or More cycle / day ................................................................. 1.0",null,null,null,null,null,null,null,null,"6. Valve Stroke Position Definitions:"]
[null,"  Clean & 2 or More cycle / day .................................................................... 1.2",null,null,null,null,null,null,null,null,"    Start (Break) Open Torque --> Start Open from Closed Position"]
[null,"  Clean, & Less Than 2 cycle / day or Throttling; Dry, Dirty, Slurry; or",null,null,null,null,null,null,null,null,"    End Open Torque --> End Open from Closed Position"]
[null,"  Cryo, & 2 or More cycle / day ...................................................................... 1.5",null,null,null,null,null,null,null,null,"    Start Closed Torque --> Start Closed from Open Position"]
[null,"  Dry, Dirty, Slurry, or Cryo, & Less Than 2 cycle/day or Throttling ..… 1.75 ",null,null,null,null,null,null,null,null,"    End Closed Torque --> End Closed from Open Position"]
[null,"  Emer. Shutoff or Less Than 1 cycle / mo ............................................... 2.0"]
[null,null,null,null,null,null,null,null,null,null,"7. Valve Stroke Position Torque Multipliers Used in Program:"]
[null,"3.  Because the minimum output torque for rack & pinion actuators occurs at an end position, the normal 1.2 break SF is sufficient for soft seated valves including control; 1.5 is recommended for hard seated valves for control.  For  Scotch Yoke actuators, with minimum output torque between the end positions, the running torque must be checked for sufficient SF for both on-off and control.",null,null,null,null,null,null,null,null,"    (Affect Spring Return Act. & Handle Selection)"]
[null,null,null,null,null,null,null,null,null,null,"    Start (Break) Open -- 1.0 for all Seat Materials"]
[null,null,null,null,null,null,null,null,null,null,"    End Open --     0.8 for PTFE, RPTFE, CRPTFE, \"Soft\";"]
[null,null,null,null,null,null,null,null,null,null,"                              1.0 for Delrin, PEEK, \"Hard\""]
[null,null,null,null,null,null,null,null,null,null,"    Start Closed -- 0.9 for PTFE, RPTFE, CRPTFE, \"Soft\";"]
[null,null,null,null,null,null,null,null,null,null,"                              1.0 for Delrin, PEEK, \"Hard\""]
[null,null,null,null,null,null,null,null,null,null,"    End Closed -- 0.85 for PTFE, RPTFE, CRPTFE, \"Soft\";"]
[null,"4. Ratios in tables are Act. Torq. to Required (Req.) Torque, which includes SF.",null,null,null,null,null,null,null,null,"                             1.0 for Delrin, PEEK, \"Hard\""]
[null,"   ",null,null,null,null,null,null,null,null,null,null,null,null,null,null,null,"JJH  6/25/21"]
[]
[]
[]
[]
[]
[]
[null,"Copy of Va!N52:N56, Act.: Va. Torq. Too Low message, used as criteria for conditional formatting of message"]
[null,"ER","Warning!  Act.:Va. Torq. = 1.13 < 1.2 TOO LOW FOR AUTOMATION!"]
[null,"UT-DA","Warning!  Act.:Va. Torq. = 1.11 < 1.2 TOO LOW FOR AUTOMATION!"]
[null,"UT-SR","Warning!  Act.:Va. Torq. = 1.03 < 1.2 TOO LOW FOR AUTOMATION!"]
[null,"Gear Op."]
[null,"Spr. Hand","Warning!  Act.:Va. Torq. = 1.98 < 1.2 TOO LOW FOR AUTOMATION!"]
[]
[null,"WOG",{"$f":"WOG","v":"NA"}]

{"sheet":"Instructions","index":1,"n_rows":116,"n_cols":11,"rows_kept":116,"cut":false,"hidden":false,"merged":[[1,7,2,10],[91,0,91,2],[91,3,91,10],[95,3,95,10],[96,7,96,8],[96,9,96,10],[96,3,96,4],[96,5,96,6]]}
[]
[null,null,null,null,null,null,null,"Marwin Ball Valve\nActuator Sizing Program"]
[]
[null,null,null,null,null,null,null,null,null,null,"Version 6.1"]
[]
["This program selects the Marwin actuator size for Marwin ball valves based on torque stated.  It is not"]
["intended to indicate availability or ability to mount actuator to valve.  While this program is presented in good"]
["faith and believed to be reasonably accurate, Marwin Valve, a division of Richards Industrials, makes no"]
["warranty, either expressed or implied. In no event shall Marwin Valve, a division of Richards Industrials, be"]
["liable toanyone for any special, collateral, incidental or consequential damage in connection with these"]
["calculations."]
[]
["Marwin Valve, A division of Richards Industrals"]
["3170 Wasson Road Cincinnati, OH 45209"]
["513-533-7340 or 800-628-2583 (toll-free) 513-533-7343 (fax)"]
["Send comments to webmaster@richardsind.co"]
[]
[]
["Instructions"]
[]
["Select series, size, seat material, and service factor from the drop down lists in the Valve Selection frame on the Menu"]
["tab. It is suggested that the selection be in the order given so that each succeeding list presents only valid options for the"]
["series.  The Size and Seat Material drop down lists contain dashes (--) in place of invalid entries.  If one of these is"]
["selected from the list or was already selected when the series is changed, Select Valid Entry appears above the list. "]
[]
["Note that valve selection entries for spring return handles and fusible links must be  made on the Menu tab, not the Menu"]
["SR_Hand tab. Spring return calculate / print, fail position, and size selection output is on the Menu SR_Hand tab.  "]
[]
["If the torque is a function of pressure, a frame for the differential pressure appears.  The entry in this frame must be"]
["between 0 and the WOG rating of the valve.  If a higher pressure is entered, Enter 0 to xxx psi appears above"]
["the pressure frame."]
[]
["To enter your own torque, select \"Own\" from the series menu, and \"Soft\" or \"Hard\" from the seat material menu. "]
["\"Soft\" treats the torque like that for a soft seat material, and \"Hard\" like that for a hard seat material, as defined in"]
["Theory below.  Enter the torque in the frame that appears for the torque."]
[]
["The Calculate or Calculate & Print button must be pushed after all entries are made or changed in the Valve Selection"]
["and Actuator frames. Actuator size and data that has not been recalculated after an entry has been made or"]
["changed is incorrect."]
[]
["Actuator selection is based on required torque, which includes the service factor.  The frame for each actuator type"]
["contains inputs for that actuator type.  It gives the actuator size selected, actuator torque, required torque, and their ratio."]
["It also has a note that gives the ratio of the actuator torque to the valve torque, which excludes the service factor, and"]
["compares it to a 1.2 minimum service factor for automation."]
[]
["When a 3-Way series is selected, Actuator not suitable for 3-Way valves in 180 degree port configuration appears"]
["in the frames for the double acting and spring return pneumatic actuators, and in the frame for the spring return unit,"]
["because the actuators are 90 degree turn devices only."]
[]
["When a direct mount (DM or DR) valve is selected, Check if selected act. bolt pattern matches va. for direct mounting"]
["appears below required torque valve selection frame.  Actuator size selection in this program is based on torque only, and"]
["ability of the selected actuator to be mounted on the valve must be checked seperately.  To assist in checking, the"]
["mounting pattern is given for actuators and direct mount valves."]
[]
["Theory"]
[]
["This program contains lookup tables of short term start (break) open torques for each valve series. End open torque is"]
["taken as 0.8 times start open torque for soft seat materials (virgin Teflon (PTFE) and glass reinforced Teflon (RPTFE)),"]
["and 1.0 times start open torque for hard seat materials (Delrin and PEEK). Start closed and end closed torques are taken"]
["as 0.9 and 0.85 times start open torque, respectively, for soft materials, and 1.0 times start open torque, respectively for"]
["hard materials. Long term start open torque is higher than short term due to the tendency of seats to take a set. Although"]
["strictly speaking, this increased torque applies to start (break) open and start closed torques only, this program "]
["multiplys all torques by the service factor multiplier when 10 or less cycles per day is selected."]
[]
["Valve operating torque curves are shown in the figures below."]
[]
[]
[]
[]
[]
[]
[]
[]
[]
[]
[]
[]
[]
[]
[]
[]
["Select actuator whose torque at the end of",null,null,null,null,null,"Select actuator whose torque at the end"]
["spring stroke exceeds torque to close valve.",null,null,null,null,null,"of air stroke exceeds torque to close valve."]
[]
[]
["The actuator size selection criteria used in this program is given in the table below.  Criteria which must be checked by"]
["the program is shown in bold italic. Some criteria is \"automatic.\"  For example, spring return actuator air start is always"]
["greater than air end torque, and valve break open torque is always greater than or equal to valve running and seat open"]
["torque.  Therefore, actuator air end will be greater than valve run torque without specifically checking for it.  However, this"]
["program checks all criteria."]
[]
["Actuator",null,null,"Selection Criteria (See Simplified Valve Torque Curve)"]
[]
["Electric",null,null,">= Max. Va. Torque (Va. Start (Break) Open Torque)"]
["Pneumatic Double Acting",null,null,">= Max. Va. Torque (Va. Start (Break) Open Torque)"]
["Gear Operator",null,null,">= Max. Va. Torque (Va. Start (Break) Open Torque)",">= Max. Va. Torque (Va. Start (Break) Open Torque)",">= Max. Va. Torque (Va. Start (Break) Open Torque)",">= Max. Va. Torque (Va. Start (Break) Open Torque)",">= Max. Va. Torque (Va. Start (Break) Open Torque)",">= Max. Va. Torque (Va. Start (Break) Open Torque)",">= Max. Va. Torque (Va. Start (Break) Open Torque)",">= Max. Va. Torque (Va. Start (Break) Open Torque)"]
[null,null,null,"Spring Start",null,"Spring End",null,"Air Start",null,"Air End"]
["Pneumatic Fail Close",null,null,">= Start Closed (1)",null,">= End Closed (2)",null,">= Start Open (3)",null,">= End Open (4)"]
["Pneumatic Fail Open",null,null,">= Start Open (3)",null,">= End Open (4)",null,">= Start Closed (1)",null,">= End Closed (2)"]
["Spring Return Unit Fail Close",null,null,">= Start Closed (1)",null,">= End Closed (2)",null,"NA",null,"NA"]
["Spring Return Unit Fail Open",null,null,">= Start Open (3)",null,"> End Open (4)",null,"NA",null,"NA"]
["Note:  Seat Open = Break Closed = Seat Closed = Running Torque"]
[]
[]
["How the Program Works"]
[]
["This program contains lookup torque tables for each valve series.  These tables contain a torque value (if torque is not a"]
["function of differential pressure), or a torque logic function or equation and the maximum differential pressure (WOG) (if"]
["torque is a function of differential pressure) for each valve size in the series."]
[]
["The program also contains tables for each actuator type.  The tables contain output torques, and fail closed and fail open"]
["logic functions for each actuator size.  These logic functions return true or false depending upon whether the actuator"]
["meets the selection criteria for the valve series, size, and pressure (if applicable) that is input.  The Calculate and"]
["Calculate & Print buttons run macros that sort the actuator data tables by logic function, then by actuator size,"]
["then by spring size.  The actuator at the top of the sorted data table is the smallest actuator of each type that meets all"]
["the selection criteria."]

{"sheet":"Changes","index":2,"n_rows":232,"n_cols":3,"rows_kept":232,"cut":false,"hidden":true,"merged":[[4,2,4,3]]}
["Release and Change History"]
[]
["Version 1",null,"Initial Release"]
["2001-08-13"]
[]
["Version 2",null,"Errors corrected--2000R, 0.25 3000F, 0.25 7000F, 0.25 10000F."]
["2001-10-08",null,"3000 & 10000 PEEK seat torques reduced by 50% (service factor of 2 removed) to be consistent with other torques."]
[null,null,"10000 sizes and torques corrected."]
[null,null,"DM600F, DM 9000 & 3L/T2S00 added."]
[null,null,"Invalid pressure warning added."]
[null,null,"Pressure limits revised for step and continuous function torques for UT600, 3K, 5K, 6K, 7K, and 10K."]
[null,null,"Instructions revised--Enter Pressure added."]
[null,null,"Fail safe pneumatic actuator logic corrected."]
[null,null,"Fail safe unit logic corrected."]
[null,null,"Changed \"Not Available\" to \"Consult Engineering\"."]
[null,null,"Added \"Consult Engineering\" to actuators which had no warning when maximum torque of largest unit exceeded."]
[null,null,"Changed gear operator handwheel pull calculation"]
[null,null,"Torque curves changed from 1.0 for break open and 0.8 for end open and start and end closed to 1.0, 0.8, 0.9, and 0.85, respectively."]
[null,null,"Fail Safe Spring Return Handle was Unit."]
[null,null,"Eliminated Spring Return Handle sizes not used by Marwin, and changed ratings of remaining sizes."]
[null,null,"Added valve torques to Spring Handle output for comparison."]
[null,null,"Corrected 6000 max press from 275 to 720 psi."]
[null,null,"Added graph to \"Act\" sheet for fail safe spring return actuator (not visible to user)."]
[null,null,"Added \"Calculate All\" and \"Calculate All & Print\" buttons."]
[null,null,"Added 1.75 \"Unspecified\" torque multiplier."]
[]
["Version 3",null,"5000 285 psi max was 720."]
["2002-10-03",null,"Added Series DR8000F.  12/19/01"]
[null,null,"Added 3L/T2S00 small sizes to program 12/20/01"]
[null,null,"Added ER20 and ER38 Elect Act. 1/5/02"]
[null,null,"Added vendor identification to electric and pneumatic actuator tables. 1/5/02"]
[null,null,"Added actuator vs. Va. torque tables w/ ratio. 1/5/02"]
[null,null,"Added 1.2 \"Minimum Automation Multiplier. 1/5/02"]
[null,null,"Added range names to actuator tables, incorporated them into macros, and renamed modules. 1/5/02"]
[null,null,"Moved electric actuator selection macro to separate module. 1/5/02"]
[null,null,"Added Series 666R and 666F. 1/20/02"]
[null,null,"Large size 3L/T2S00 redesignated 3L/T2S33.  Small size 3L/T2S00 redesignated 3L/T2Q33.  1/20/02"]
[null,null,"Corrected error in description of 3L-2000  1/20/02"]
[null,null,"\"Warning!  Act.:Va. Torque w/out Service Fact. less than 1.2!\" added 1/20/02"]
[null,null,"Added Series 3L3100, 3L3299, 3T3300, and 3L3400.  1/22/02."]
[null,null,"Added logic to force UT-SR spring set selection equal to Act. Press.  2/17/02"]
[null,null,"Suppressed \"99999\" actuator torques for valve torques exceeding actuator sizes in program.  2/18/02"]
[null,null,"3T3100 was 3L3100--Changed to agree w/ computer instead of bulletin.  3/12/02"]
[null,null,"Brass was bronze in description for 3T3100, 3L3200, 3T3300, 3L3400.  3/12/02"]
[null,null,"Changed RPTFE seats to PTFE seats for 3T 3100 and 3L3200.  3/21/02"]
[null,null,"Rearranged menu format 3/22/02."]
[null,null,"Renamed \"Va. Torque\", which includes SF, to \"Required Torque\", & added new \"Va. Torque, which does not include SF.  3/24/02 "]
[]
["Version 4",null,"Renamed sheets by replacing 1000 by K; example, 3000 became 3K.  7/5/02"]
[null,null,"Renamed 3L or 3T to 3W.  7/5/02"]
[null,null,"Consolidated 3K, 7K, and 10K; and 5K and 6K; and 8K and CF 8000 sheets.  7/5/02"]
[null,null,"Added Series 4600R and 4600F.  7/5/02"]
[null,null,"Seperated Elect., DA Pneu., SR Pneu., and SR handles onto separate worksheets.  7/7/02"]
[null,null,"Changed old DA and SR Pneumatic ratings, and added new ratings.  7/7/02"]
[null,null,"Removed logic that forced UT-SR spring set selection equal to Act. Press."]
[null,null,"Added drop-down box to menu to choose old or new UT actuators.  7/26/02"]
[null,null,"Added 70000 Series 2-Way and 3-Way wafer ball valves. 7/27/02"]
[null,null,"Added macro to automatically initialize workbook on opening to 1.2 SF, \"automatic\" UT design, 80 psi supply, fail closed, 18 in. Max HW Dia, 80 lb max HW pull.  7/28/02"]
[null,null,"Old Design Pneumatic ratings source changed from Marwin bulletin UT Series-1099 G to Valbia Cat. 970/C.  8/6/02"]
[null,null,"Old Design Pneumatic ratings source changed from Valbia Cat. 970/C to Valbia Cat. 028/A for sizes not redesigned (0A, 5, 6, 7).  8/7/02"]
[null,null,"Added ability to input own valve torque.  8/23/02"]
[null,null,"Changed logic to select spring that gives highest minimum Act. to required Va. torque ratio (instead of lowest spring set No.).  9/3/02"]
[null,null,"Spring Set Pressures added to UT-SR tables."]
[null,null,"7K Delrin torques corrected to be same as corresponding 3K Delrin torques.  10/3/02"]
[null,null,"Changed DR8000 seats from PTFE to RPTFE  to agree w/ inventory, and increased torques by 1.35 due to this change.  10/25/02"]
[null,null,"ER-5K thru ER-27K (Indelac K Series) added.  These are not published in Marwin literature and are special. 10/26/02."]
[null,null,"Added ProGear gear operators.  10/27/02"]
[null,null,"Added  warning that PEEK seat torque is extremely sensitive to pressue.  10/27/02"]
[null,null,"0.25\" thru 0.75\" 4600R and 4600F torques corrected.  11/27/02"]
[null,null,"Max. pressure for 6000 series changed to 740 psi (based on carbon steel), was 720 psi (based on SS).  1/6/03"]
[null,null,"10\"R 5K torque corrected -- 9600 in-lb 0 to 100 psi, 12000 in-lb above 101 psi up was 9600 in-lb.  2/14/03"]
[null,null,"Pro-Gear nom. hwl. dia's replaced by actual & alternate hwl. dia's removed because they are not stocked by local distributor.  2/17/03"]
[]
["Version 4.1",null,"ER-5K, -7K, -12K, -14K, & -27K replaced by ER-50, -70, -120, -140, & -270, respectively.  2/18/03 & 4/8/03"]
["2003-04-08",null,"Corrected Pro-Gear Hwl. selection calculation in cells Oper! AE26 to AE34 & AF26 to AF24 ($AN$40 was $AN$20).  4/2/03"]
[null,null,"Due to depletion from stock of old-dsgn, UT DA sizes -0, -1, -3, & -4 & UT SR sizes -1, -2, & -4 default changed from old (1) to new (2).  Only UT size w/ new"]
[null,null,"    dsgn. that still has significant quantity in stock & defaults to old is -3.5-SR. (UT sizes -0A & -5 thrugh -7 do not have new dsgn. & default to \"old\" (1)).  4/8/03"]
[null,null,"Corrected D.A. act. selection calculation in cell Menu!P24  (DA!C50 was DA!C7).  4/8/03"]
[]
["Version 4.2",null,"Removed 0.25\" & 0.38\" DM9000, because they are not available.  4/23/03"]
["2003-04-24",null,"Corrected gear op. max. hwl. pull calculation (AN63 was AN20 in AF6:AF17 & AN40 in AF26:AF34).  4/24/03"]
[null,null,"Pro-Gear nom. hwl. dia's changed to include several alternate hwl. dia's based on meeting w/ local distributor 4/9/03.  4/24/03"]
[null,null,"Removed UT600F from program, because they are not available.  4/24/03"]
[null,null,"Corrected 16 in. default hwl. dia. initialization.  4/24/03"]
[null,null,"Corrected hwl. dia. & turns display on \"Menu\" page so it wouldn't be blank when it wasn't suppossed to (AD49 was AD6).  4/24/03"]
[null,null,"Added \"Own\" to va. stroke position multiplier note, numbered notes, & added reference to Note 5 near va. selection box.  4/24/03"]
[null,null,"Added Disclaimer to top of Instructions page.  4/24/03"]
[null,null,"Moved change history from instruction page to seperate change page.  4/24/03"]
[]
["Version 4.3",null,"Eliminate 0.25\" & 0.38\" DM9000F sizes.  8/1/03"]
["2003-08-06",null,"Increased 2\" DM9000F torque per Valbia 7/22/03 e-mail, but kept old torques for other sizes.  8/1/03"]
[null,null,"Eliminated 2.5\" size for 3T-3300R / 3L-3400R.  8/1/03"]
[null,null,"Added Series KF8000F.  8/6/03"]
[null,null,"Added soft / hard option to \"Own\" torque input.   8/6/03"]
[null,null,"Obsolete 3L/T-2000F \"3-Way FE, Uni-body, Full Port, ANSI 150\" (Seats R, Sizes 1-6, no 1.25), removed from menu.   8/6/03"]
[null,null,"Added direct mounting note to valve selection frame and to instructions.   8/6/03"]
[null,null,"Corrected DA & SR old-new selection table so \"Consult Eng.\" appears when torque too high for largest actuator.  8/6/03"]
[]
["Version 4.31",null,"Error in 2000F_300 torque calculation corrected.  Was using torque for 2000F_150.  9/29/03"]
[null,null,"Service factors listed under Menu Note 2.  9/29/03"]
[]
["Version 4.4",null,"CRPTFE (Starfill) seat added to 3K, 7K, 10K.  CRPTFE (Starfill) & PTFE added to 5K, 10K.  10/6/03"]
["2003-10-07",null,"Added \"no provisions for actuator mounting\" note to valve selection frame for 666F and 666R.   10/7/03"]
[null,null,"Added \"sizes 1.5\" and smaller cannot be automated\" note to valve selection frame for 3T-3100 and 3L-3200.   10/7/03"]
[null,null,"Size 2.5F & 3R Series 8000 torque revised:  650 was 850, based on test of one va. & plot showing 2.5\" torque was out of line w/ other sizes.  10/11/30"]
[null,null,"Corrected \"Throttling Service Factor\" to give required torque twice va. torque instead of \"#NA.\"  10/18/03"]
[null,null,"Hid formulae, protected \"Menu\" sheet upon opening, and added password protection.  10/18/03"]
[]
["Version 4.41",null,"Added 115 psi air pressure for spring return pneumatic actuators.  11/7/03"]
[null,null,"Added chainwheel warning note for Q200 & Q400.  11/10/03"]
[null,null,"Corrected WOG pressure lookup by adding no. of seat mat'l col's in va. lookup tables to Table 1.  JJH  12/9/03"]
[null,null,"Corrected password protection.  JJH  12/11/03"]
[null,null,"Added 1.5\" 2000F-300.  JJH  12/12/03"]
[]
["Version 4.5",null,"SR Hand. moved to seperate menu (2/15/04) & separate \"Calc\" & \"Calc-Print\" macro made for it so it to function properly (8/31/04).  JJH"]
["2004-11-24",null,"DR8000 torque values revised & Teflon seat mat'l added.  JJH  2/15/04"]
[null,null,"KF89 torque values revised.  JJH  2/15/04"]
[null,null,"Spring return handle torques revised.  JJH  2/15/04"]
[null,null,"Added \"Direct Mount\" to DM600F, 3T-3300F, 3L-3400F descriptions.  JJH  2/16/04"]
[null,null,"Added mounting patterns to actuators and direct mount valves.  JJH  2/16/04"]
[null,null,"Changed KF8000 to KF8900.  JJH  6/22/04"]
[null,null,"Eliminated PTFE, RPTFE, and CRPTFE seat mat'ls from 10K per D. Behm 7/16/04 request.  JJH  8/31/04"]
[null,null,"Eliminated 70000 Series.  JJH  8/31/04"]
[null,null,"Added 4700F, 5800F/R, 6800F/R, and 8700F series.  JJH  8/31/04"]
[null,null,"Added CR-PEEK & revised PEEK torques for 3K per D. Behm 9/3/04 request.  JJH  9/7/04"]
[null,null,"Changed location where seat material column in torque tables is identified from seat table to torque tables, so a specific material doesn't have to be in"]
[null,null,"same torque table column for all series.  JJH  9/7/04"]
[null,null,"Added Marwear & Marwinite seat materials & MS10K to program.  JJH  9/7/04"]
[null,null,"UT old / new actuator status updated (All now new).  JJH 9/10/04"]
[null,null,"Changed AT Controls gear operator to \"Alecto\".  JJH  11/4/04"]
[null,null,"Added DynaTorque & MasterGear gear operators.  JJH  11/4/04"]
[null,null,"0.25\" & 0.38\" 3T-3700 / 3L-3800 RPTFE torque 93 was 100-Changed so UT-1-SR-80 FC selected w/ 1.2 SF based on customer experience.  JJH  11/4/04"]
[null,null,"Default Old/New/Automatic UT selection changed from automatic to new, and selection box moved from menu to DA sheet so it is not accessible to user.  JJH  11/19/04"]
[]
["Version 4.51",null,"KF89 size range changed from 0.5~3, no 1.25, to 0.5~4, no 1.25.  JJH  1/7/05"]
["2005-03-23",null,"3\" 4600R added.  JJH  1/20/05"]
[null,null,"0.5\" 3K, MS3K, 10K, MS10, series torque equation corrected --  240 constant in equation was 360.  JJH  3/2/05"]
[null,null,"Input for SR Handles moved from Menu SR_Hand to Menu.  In Ver. 4.5, the pressure from Menu was being used, not the pressure input on"]
[null,null,"Menu SR_Hand, and there was no way to make the program work for pressure input in two places. Input values shown on Menu SR_Hand"]
[null,null,"made reference only.  JJH  3/13/05"]
[null,null,"0.75\" 4700F & 8700 RPTFE torque reduced from 70 to 57 in-lb, & other seat mat'ls reduced proportionally, per RI test & production, & Emico test.  JJH  3/23/05"]
[null,null,"3L/T-3900 size range changed from 0.5\"~2\" to 0.5\", 1\", 2\".  JJH  3/23/05"]
[]
["Version 4.52",null,"DT2 & 5 added; DT1 eliminated.  JJH  3/23/05"]
["2005-03-29",null,"Added descriptiors \"Metal\" to Marwear & \"Carbon\" to Marwinite.  JJH  3/29/05"]
[]
["Version 4.53",null,"3000F size range changed from 0.5\" ~ 3\" to 0.25\" ~3\".   JJH  4/23/05"]
["2005-04-23",null,"1.25\" & 1.5\" 3000F CRPTFE max press changed from 2200 to 2500 psi.  JJH  4/23/05"]
[]
["Version 4.54",null,"5000 and 6000 torques revised 2/4/06; 5000 and 6000 torques were same below & above 100 psi; max torque kept for 6000 at max rating; torques reduced for lower"]
["2006-07-21",null,"     pressures based on limited testing & comparison w/ 2000 & 58/6800 series & prorated between 100 and max rating;  PTFE torques changed from 90% of old to"]
[null,null,"     90% of new RPTFE torques.  JJH  2/4/06"]
[null,null,"6800 torques changed to 5800 values below 285 psi max 5800 rating, because 5800 & 6800 are same except wall thickness.  JJH  2/4/06"]
[null,null,"DM600 torques changed per Valbia Rubinetterie Bresciane Scheda S-04.4/5 - Prova di laboratorio n. torque 250N.doc 6/6/05   JJH 23/3/06"]
[null,null,"2000F-F3 torques changed per TVC 2004 torque chart.  Old torques also had cruve fit problem that caused 2.5\" torque to be higher than 3\" at certain pressures.  JJH  6/9/06"]
[null,null,"Following obsolete series removed from program:  7000F&R, 8000F&R, DR8000F, 3L-8000F, 3L-9000F.  JJH  6/11/06"]
[null,null,"Reminents of previous obsolute programs removed:  3L/T-2000F, UT-600F.  JJH  6/11/06"]
[null,null,"Corrected table name range to eliminate apprearanc of \"REF\" for 2000R act. Mtg. Ptrn.  JJH  6/11/06"]
[null,null,"UT-4.5-SR added to new UT actuators.  JJH  6/11/06"]
[null,null,"UT stock status, and old UT data removed.  Tables and logic left to maintain program logic for future alternate actuator.  JJH  6/11/06"]
[null,null,"Added 1\", 1.5\"-2000R-F1, 1\"-2000F-F3.  JJH  6/14/06"]
[null,null,"Removed 1.25\"-2000F-F1.  JJH 6/14/06"]
[null,null,"Corrected \"Air Torque @ \" label in SR charts--no effect on selection.  JJH  6/26/06"]
[null,null,"Added spring return electric actuators.  JJH  6/27/06"]
[null,null,"Dynatorque DTSD & DTSRD declutchable GO's added.  JJH 6/28/06"]
[null,null,"Service factor menu reconfigured.  JJH  6/29/06"]
[null,null,"Added fusible links.  JJH  7/10/06"]
[null,null,"Reconfigured size and seat material menu tables within program (sizes & materials from torque tables used instead of seperate tables).  JJH  7/14/06"]
[null,null,"Added 3x2 MS3K, 10K, MS10K.   JJH  7/14/06"]
[null,null,"Removed Max. input torque as gear operator selection criteria.  JJH  7/27/06"]
[]
["Version 5.0",null,"Restored seperate size and seat material menu tables to prevent size and seat material from changing when series changed.  JJH  8/6/06"]
["2007-01-13",null,"Revised logic statements for valve torque / pressure labels so error indications wouldn't appear where labels should be when invalid seat material selected.  JJH  8/6/06"]
[null,null,"Note on menu was \"RATIO OF ACT. TO VA. TORQUE (EXCLUDING SERVICE FACTOR) SHOULD NEVER BE LESS THAN 1.2 FOR AUTOMATION\". Changed to"]
[null,null,"avoid conflict with reconfigured service factors.  JJH  8/6/06"]
[null,null,"Note when Act:Va. Torq. Ratio less than 1.2 was \"Warning!  Act.:Va. Torq. = 1.25 < 1.2 TOO LOW FOR AUTOMATION!\"  Changed to avoid conflict with reconfigured"]
[null,null,"service factors.  JJH  8/6/06"]
[null,null,"Added PTFE (0.9 x RPTFE) to 2000F-150 & 2000R-150.  JJH  11/11/06"]
[null,null,"Added CRPTFE (1.15 x RPTFE) to 2000.  JJH  11/11/06"]
[null,null,"Increased 3\"F /4\"R 3K PTFE torque (was 0.9729 x Press + 779.32).  JJH  11/11/06"]
[null,null,"Added UHMW-PE to 3K (1.5 PTFE), 2K (1.15 RPTFE for F1, 1.3 PTFE for F3), 47/87 (1.3 PTFE), 5/6K (1.3 PTFE), and 5800/6800 (1.3 PTFE)."]
[null,null,"     2.5\"F, 3\"F, 3\"R, 4\"R curve fit to reduce value of torque above pressure limit of PTFE, because PTFE torques are a function of pressure.  JJH  11/11/06"]
[null,null,"Added CPEEK to 3K (1.25 x PEEK) & modified PEEK pressure sensitivity note to include CPEEK.  JJH  11/11/06"]
[]
["Verison 5.1",null,"10K Delrin Seat column no. corrected (6 was 5); affected maximum pressure.  JJH  3/12/07"]
["2007-08-02",null,"10K torques changed from 3000R torques to 3000F torques.  Since there was no 2\"F 3K Delrin torque, that torque was adjusted by comparing with other sizes and"]
[null,null,"with PEEK torque.  JJH  6/30/07"]
[null,null,"0.75\"F to 2\"F 3K and 10 K Delrin torques at 0 psid slightly adjusted for logical progression by size.  JJH  6/30/07"]
[null,null,"5800F, 5800R, and 6800F deleted; 5801F, 5801R, 6801F added.  JJH  6/30/07"]
[null,null,"Logic for note to right of torque on Menu page changed to check for \"Own\" series.  Note above seat mat'l changed to be specific for named and \"Own\" series.  JJH  8/2/07"]
[null,null,"Logic added to prevent showing actuator size or data for torques exceeding 99999 in-lb actuator torque chart limit.  Sort routine that selects actuator size was"]
[null,null,"properly selecting \"consult engineering\" for torques between actuator upper limit and 99999 in-lb, but incorrectly selecting an acutator size for torques above 99999"]
[null,null,"in-lb.  This only occurred for \"own\" torque input.  JJH  8/5/07"]
[null,null,"27301 was 7021 in-lb lower limit for \"Consult Engineering\" in electric actuator table; changed to agree with additon of larger ER actuators on 10/26/02.  JJH  8/5/07"]
[null,null,"1001 / 99999 in-lb \"Not Available\" added to electric spring return actuator table.  JJH  8/5/07"]
[null,null,"Changed blank cell to \"--\" for \"99999 \"Consult Engineering\" gear operator mounting to surpress mm showing for stem square size when \"consult engineering\" applicable.  JJH  8/5/'07"]
[null,null,"Changed \"Consult Engineering\" to \"Not Available\" for 99999 in-lb in fusible link table.  JJH  8/5/07"]
[]
["Verison 5.1a",null,"Corrected problem with 2000F-F3 Series Menu (Table 1).  Had incorrect size range.  JJH  1/26/12"]
["2012-01-26"]
[]
["Verison 5.1b",null,"Revised 5801 and 6801 torques.  6\" & 8\" torques increased significantly.  JJH  5/7/14"]
["2014-05-07"]
[]
["Version 5.1b1",null,"Changed 3T-3700 / 3L-3800 seat material from RPTFE to Teflon.  Torques unchanged.  JJH  7/12/14"]
["2014-07-12"]
[]
["Version 5.1b2",null,"Changed max pressure for MS3K from 1440 to 1000 psi.  JJH  6/20/15"]
["2014-06-20",null,"Changed seats for MS3K & MS10K to W5 (Class V) only.  JJH  6/20/15"]
[]
["Version 6.0",null,"Richards Industrials was Richards Industries, and Marwin logo changed to 2007 logo."]
["2020-08-01",null,"3L or 3T-2100 (DE Series M4 & M4F) was 3L or 3T_2Q33F & 3L or 3T_2S33F (TVC Series 30M & 33M).  Torques changed accordingly. "]
[null,null,"CF8901F (Sigma SAS-301T/B-M-SL) was KF8900 (John Valve Series JV9301NC)"]
[null,null,"9700 (DE Series FSB-26) added"]
[null,null,"FE was ANSI in valve menu table (Table 1)"]
[null,null,"Computer User Name function removed for compatability with 64 bit computers"]
[null,null,"\"Reduced\" was \"Std.\""]
[null,null,"3T-3101/3L-3201 was 3T-3200/3L-3100"]
[null,null,"4600R size range corrected 1-1/4\"~3\" was 1/4\"-3\""]
[null,null,"6800R eliminated"]
[null,null,"Fixed electric actuator selection on menu to output failsafe when that option selected."]
[null,null,"Corrected \"Consult Eng\" size order in DA Table 6B: 13 was 12."]
[null,null,"1\" & 1.5\" DM600 torque corrected"]
[null,null,"0.25\" & 0.38\" 10K Delrin, PK, & CPK torques corrected to be same as 1/2\" torques"]
[null,null,"UT-6.5 & UT-7.5 added"]
[null,null,"Act.:Req. torque ratios in menu tables were Act.:Va., and criteria 1.0 was 1.2"]
[null,null,"Removed Spring Return Handle / Fusible Link Menu, data page, and modules"]
[null,null,"New Note 3 added and original Notes 3-6 renumbered 4-7."]
[]
["Ver 6.1",null,"Corrected max torque for 1.5\"F RPTFE:  1500 was 1000.  JJH  6/5/21"]
["2021-06-25",null,"Corrected max torque for 1.25\"F and 1.5\"F CRPTFE:  2200 was 2500.  JJH  6/5/21"]
[null,null,"Added times to UT-SR Sizing  JJH 6/25/21"]

{"sheet":"Elect","index":3,"n_rows":49,"n_cols":20,"rows_kept":49,"cut":false,"hidden":true,"merged":[[46,0,46,1],[46,2,46,4],[3,17,4,17],[3,18,3,19],[4,2,4,4],[4,0,4,1],[27,0,27,1],[27,2,27,4],[4,8,5,8],[27,8,28,8],[3,14,5,14],[3,15,4,15],[3,16,4,16]]}
["Electric Actuator"]
[]
[null,null,null,null,null,null,"Elect_Act"]
["Electric Act. Data Table (Table 5A)",null,null,null,null,null,"A6:I22",null,null,null,null,null,null,null,"Model Number","ER","Torque","Cycle Time","Mounting"]
["Torque Range",null,"Electric Actuator",null,null,"Act. >=",null,null,"Cycle Time, s",null,"Elect Actuator Version",null,null,null,null,null,null,null,"Blt Ptrn","Stem"]
["Min","Max","Model No.","Indelac ID","lbf-in.","Va. Open","Mounting","Stem Connect.",null,null,null,"Menu",null,null,null,null,"(In-Lbs.)","(Sec/90)","ISO or in.","mm"]
[101,200,"ER-2","SD",200,{"$f":"AND(E7>=SOT)","v":true},"F05","14mm Female Star",5,null,1,"ER",null,null,"SD or SR","ER2",200,5,"F03/F05/F07 (SD Reg)","14 Female Star"]
[201,300,"ER-3","SDX",300,true,"F05","14mm Female Star",5,null,2,"ES, AS, or ASC Fail Safe Spr Rtn",null,null,"SDX or SX","ER3",300,5,"F03/F05/F07 (SD Reg)","14 Female Star"]
[301,400,"ER-4","SH",400,true,"F07","17mm Female Star",10,null,null,null,null,null,"MS","ER4",400,10,"F07","17 Female Star"]
[401,675,"ER-6","MR",675,true,"F07","17mm Female Star",15,null,null,null,null,null,"MR","ER6",675,15,"F07","17 Female Star"]
[676,1000,"ER-10","ML",1000,true,"F07","17mm Female Star",15,null,1,{"$f":"VLOOKUP(K11,K7:L8,2,FALSE)","v":"ER"},null,null,"ML","ER10",1000,15,"F07","17 Female Star"]
[1001,1500,"ER-15","MH",1500,true,"F07/F10","17mm Female Star",30,null,null,null,null,null,"MH","ER15",1500,30,"F07/F10","17 Female Star"]
[1501,2000,"ER-20","LA",2000,true,"F07/F10","22mm Female Star",12,null,null,null,null,null,"LA-12","ER20",2000,12,"F07/F10","22 Female Star"]
[2001,3840,"ER-38","LX",3840,true,"F07/F10","22mm Female Star",14,null,null,null,null,null,"LX-14","ER38",3840,14,"F07/F10","22 Female Star"]
[3841,5000,"ER-50","5K",5000,true,"F14 & 4.24 BC","22.2mm Male DD",38,null,null,null,null,null,"5K","ER50",5000,38,"F14&(4)0.375-16 on 4.242BC","22.2 Male DD"]
[5001,7020,"ER-70","7K",7020,true,"F14 & 4.24 BC","22.2mm Male DD",38,null,null,null,null,null,"7K","ER70",7020,38,"F14&(4)0.375-16 on 4.242BC","36.1 Male DD"]
[7021,11520,"ER-120","12K",11520,true,"F14 & 4.24 BC","22.2mm Male DD",58,null,null,null,null,null,"12K","ER120",11500,58,"F14&(4)0.375-16 on 4.242BC","36.1 Male DD"]
[11521,14040,"ER-140","14K",14040,true,"F14 & 4.24 BC","36.1mm Male DD",58,null,null,null,null,null,"14K","ER140",14040,58,"F14&(4)0.375-16 on 4.242BC","36.1 Male DD"]
[14041,19200,"ER-190","19K",19200,true,"(8) 0.625-11 on F14 BC","36mm Male DD",114,null,null,null,null,null,"19K","ER190",19200,114,"(8) 0.625-11 on F14 BC","36 Male DD"]
[19201,27300,"ER-270","27K",27300,true,"F14 & 4.24 BC","2.375\" Bore&Key",136,null,null,null,null,null,"27K","ER270",27300,136,"(8) 0.625-11 on 7.50 BC","2.375 Bore&Key"]
[27301,99999,"Consult Eng.",null,99999,true,"--","--","--"]
[0,100,"ER-1","R",100,false,"F03/F05","9mm Female Star",2.5,null,null,null,null,null,"R & RXP","ER1",100,2.5,"F03/F05","9 Female Star"]
["Indelac"]
[]
[]
[null,null,null,null,null,null,"Elect_FS_SR_Act"]
["Electric Fail Safe Spr. Rtn. Act. Data Table (Table 5B)",null,null,null,null,null,"A30:I35"]
["Torque Range",null,"Electric FS SR Actuator",null,null,"Act. >=",null,null,"Cycle Time, s"]
["Min","Max","Model No.","Indelac ID","lbf-in.","Va. Open","Mounting","Stem Connect."]
[676,1000,"ES2","ES2",200,{"$f":"AND(E30>=SOT)","v":true},"F07/F10","17mm Female Star",10,null,null,null,null,null,null,"ES2",200,"10/2","F07/F10","17 Female Star"]
[201,300,"AS4/ASC4","AS4/ASC4",400,{"$f":"AND(E31>=SOT)","v":true},"F07","17mm Male Sq.",12,null,null,null,null,null,null,"AS4/ASC4",400,"12/2","F07","17 Male Sq."]
[301,400,"AS6/ASC6","AS6/ASC6",600,{"$f":"AND(E32>=SOT)","v":true},"F07","17mm Male Sq.",12,null,null,null,null,null,null,"AS6/ASC6",600,"12/2","F07","17 Male Sq."]
[401,675,"AS10/ASC10","AS10/ASC10",1000,{"$f":"AND(E33>=SOT)","v":true},"F10","25.4mm Male Sq",12,null,null,null,null,null,null,"AS10/ASC10",1000,"12/2","F10","25.4 Male Sq"]
[676,1200,"ASC12","ASC12",1200,{"$f":"AND(E34>=SOT)","v":true},"F10","25.4mm Male Sq",12,null,null,null,null,null,null,"ASC12",1200,"12/2","F10","25.4 Male Sq"]
[1201,99999,"Not Available","--",99999,false,"--","--","--"]
[]
[]
[]
[]
[]
[]
[]
[]
[]
[]
["Electric Act. Selection Table (Table  5C)",null,null,null,null,{"$f":"CHOOSE($K$11,G3,G26)","v":"Elect_Act"}]
["Torque Range",null,"Electric Act. Torq. Info., in-lb"]
["Min","Max","Model No.","Indelac ID","lbf-in.","Va. Open","Mounting","Stem Connect.","Time, s"]
[{"$f":"CHOOSE($K$11,A13,A24)","v":1501},{"$f":"CHOOSE($K$11,B13,B24)","v":2000},{"$f":"CHOOSE($K$11,C7,C30)","v":"ER-2"},{"$f":"CHOOSE($K$11,D7,D30)","v":"SD"},200,true,"F05","14mm Female Star",5]

{"sheet":"Va","index":4,"n_rows":84,"n_cols":62,"rows_kept":84,"cut":false,"hidden":true,"merged":[[2,26,3,26],[2,43,3,43],[26,2,26,4],[27,2,27,4],[30,2,30,4],[10,2,10,4],[11,2,11,4],[12,2,12,4],[13,2,13,4],[31,2,31,4],[32,2,32,4],[34,2,34,4],[18,2,18,4],[19,2,19,4],[28,2,28,4],[20,2,20,4],[21,2,21,4],[29,2,29,4],[22,2,22,4],[23,2,23,4],[24,2,24,4],[25,2,25,4],[33,2,33,4],[41,2,41,4],[35,2,35,4],[37,2,37,4],[38,2,38,4],[39,2,39,4],[36,2,36,4],[1,51,1,61],[4,31,5,31],[45,2,45,4],[2,23,3,23],[3,2,3,4],[4,2,4,4],[5,2,5,4],[6,2,6,4],[7,2,7,4],[8,2,8,4],[9,2,9,4],[14,2,14,4],[15,2,15,4],[16,2,16,4],[17,2,17,4],[40,2,40,4]]}
["Valve Control"]
["Marwin Valve Series Menu (Table1)",null,null,null,null,null,null,null,null,null,null,null,null,"Series",null,null,null,null,null,null,null,null,null,null,null,null,null,null,null,null,null,null,null,null,null,null,null,null,null,null,null,null,null,null,null,null,null,null,null,null,null,"Series"]
[null,"Menu","Description",null,null,"Sizes","Seats","No. Col's",null,null,null,null,null,"7000F","666F","666R",null,"4600F","9000F",null,"3T3100F","MS3000","DM600F","3L_or_3T\n_2100F_F",null,null,"3L_or_3T\n_3900F","8700F",null,"3000F",null,"3000R","CF8000F","2000F_150",null,"5800F","5000F",null,"5800R","5000R","2000R_150",null,"2000F_300","3L_or_3T_2S33F","3L9000R",9700,null,null,null,null,null,"3000R","7000R","DR8000F","666R","8000R","2000R_150","4700F","10000F","MS3000",9700,"Own"]
[1,"*****2-Way********","***************************************************************************",null,null,"*****************","************","*************",null,null,null,null,null,null,null,"7000R",null,"3L8000F",null,"4600R","3L3200F","10000F","8000R",null,null,null,null,"9000R",null,"4600R",null,"4700F","KF8900F",null,null,"6800F","6000F",null,"6800R","6000R",null,null,null,null,null,null,null,null,null,null,null,"3000F","7000F",null,"666F","8000F","2000F_150","5000R",null,"MS10000"]
[2,"666R","2-Pc Brass Reduced Port, 600 WOG",null,null,".5 - 2","T","4",null,null,null,null,null,null,"DR8000F","8700F",null,null,null,null,null,"MS10000","8000F",null,null,null,null,"DM9000F",null,null,null,"3L_or_3T\n_2100F_A","CF8901F",null,null,null,null,null,null,null,null,null,null,null,null,null,null,null,null,null,null,null,null,null,"DM600F","9000R","2000F_300","5000F"]
[3,"666F","2-Pc Brass Full Port, 600 WOG",null,null,".25 - 2","T","4",null,null,null,null,null,null,null,"9000R",null,null,null,null,null,null,null,null,null,null,null,null,null,null,null,null,null,null,null,null,"5801F",null,null,null,null,"5801R",null,null,null,null,null,null,null,null,null,null,null,null,"4600R","9000F","3L_or_3T_2100F","5800R"]
[4,"DM600F","2-Pc Full Port, Direct Mount, 600 WOG",null,null,".25 - 4","T","4",null,null,null,null,null,null,"3T3300R","DM9000F",null,null,null,null,null,null,null,null,null,null,null,null,null,null,null,null,null,null,null,null,"6801F",null,null,null,null,null,null,null,null,null,null,null,null,null,null,null,null,null,"4600F",null,"3L_or_3T_2S33F","5800F"]
[5,"2000R_150","FE Uni-body, Reduced Port, FE 150",null,null,"1-4, no 1.25, 2.5","R, S, U","4",null,null,null,null,null,null,"3L3400R",null,null,null,null,null,null,null,null,null,null,null,null,null,null,null,null,null,null,null,null,null,null,null,null,null,null,null,null,null,null,null,null,null,null,null,null,null,null,null,"CF8000F",null,null,"6000R"]
[6,"2000F_150","FE 2-Pc Body, Full Port, FE 150",null,null,".5 - 6, no 1.25","R, S, U","4",null,null,null,null,null,null,"3T3700R",null,null,null,null,null,null,null,null,null,null,null,null,null,null,null,null,null,null,null,null,null,null,null,null,null,null,null,null,null,null,null,null,null,null,null,null,null,null,null,"KF8900F","3T3300R",null,"6000F"]
[7,"2000F_300","FE 2-Pc Body, Full Port, FE 300",null,null,"1.5-4","R, S, U","4",null,null,null,null,null,null,"3L3800R",null,null,null,null,null,null,null,null,null,null,null,null,null,null,null,null,null,null,null,null,null,null,null,null,null,null,null,null,null,null,null,null,null,null,null,null,null,null,null,"DM9000F","3L3400R",null,"6800R"]
[8,"3000R","3-Pc Fire Safe, Reduced Port, 3000 WOG",null,null,".5 - 4","T,R,S,U,D,P,CP","7",null,null,null,null,null,null,null,null,null,null,null,null,null,null,null,null,null,null,null,null,null,null,null,null,null,null,null,null,null,null,null,null,null,null,null,null,null,null,null,null,null,null,null,null,null,null,"3T3100F","3T3700R",null,"6800F"]
[9,"3000F","3-Pc Fire Safe, Full Port, 3000 WOG",null,null,".25 - 3","T,R,S,U,D,P,CP","7",null,null,null,"Size Menu (Table 2)",null,null,"Horizontal Lookup Table",null,null,null,null,null,null,null,null,null,null,null,null,null,null,null,null,null,null,null,null,null,null,null,null,null,null,null,null,null,null,"Size_Range",null,null,null,null,null,null,null,null,"3L3200F","3L3800R",null,"8700F"]
[10,"MS3000","3-Pc Metal Seated, Sch. 160 Port, 1000 WOG",null,null,".25-3x2, no 2.5","W5","7",null,null,null,"Menu","Col:  ",1,2,3,4,5,6,7,8,9,10,11,12,13,14,15,16,17,18,19,20,21,22,23,24,25,26,27,28,29,30,31,32,33,null,null,null,null,null,null,null,null,"3T3700R","3L_or_3T_3900F",null,"5801R"]
[11,"4600R","3-Pc Brass, Reduced Port, 600 WOG",null,null,"1.25-3","T","4",null,null,null,{"$f":"F46","v":".25 - 3"},"Row for",".25-1.5, no .38",".25 - 2",".25-2, no .38",".25-2, no 1.25",".25 - 2.5",".25 - 3","1.25-3",".25-3, no 2.5",".25-3x2, no 2.5",".25 - 4",".5 - 6",".38 - 6",".5 - 1.5",".5,1,2",".5 - 2",".5 - 2.5",".5 - 3",".5-3, no 1.25",".5 - 4",".5-4, no 1.25",".5 - 6, no 1.25",".5 - 8",".5-8, no 1.25",".5-8, no 1.25, 2.5",".5 - 10",".5-10, no 1.25",".5-10, no 1.25, 2.5","1-4, no 1.25, 2.5","1-8, no 1.25,2.5","1.5-4","2 - 6","3","0.25F-1.5F, 2R",null,null,null,null,null,null,null,null,"3L3800R","3L8000F",null,"5801F"]
[12,"4600F","3-Pc Brass, Full Port, 600 WOG",null,null,".25 - 2.5","T","4",null,null,null,null,null,null,null,null,null,null,null,null,null,null,null,null,null,null,null,null,null,null,null,null,null,null,null,null,null,null,null,null,null,null,null,null,null,null,null,null,null,null,null,null,null,null,null,"3L9000R",null,"6801F"]
[13,"4700F","3-Pc, Full Port, 2000 WOG Dir Mt w/Lever / 150 WSP",null,null,".5 - 4","T, R, S, U","5",null,null,1,{"$f":"HLOOKUP($F$46,$N$14:$AT$29,K16+2,FALSE)","v":"0.25"},"0.25","0.25","0.25","0.25","0.25","0.25","0.25","--","0.25","0.25","0.25","--","--","--","--","--","--","--","--","--","--","--","--","--","--","--","--","--","--","--","--","--","--","0.25F"]
[14,"5000R","FE, Uni-body, Reduced Port, FE 150",null,null,".5-10, no 1.25, 2.5","T, R, S, U","5",null,null,2,"0.38","0.38","--","0.38","--","0.38","0.38","0.38","--","0.38","0.38","0.38","0.38","0.38","--","--","--","--","--","--","--","--","--","--","--","--","--","--","--","--","--","--","--","--","0.38F"]
[15,"5000F","FE, Uni-body ≤ 1\" / Split Body > 1\", Full Port, FE 150",null,null,".5-8, no 1.25, 2.5","T, R, S, U","5",null,null,3,"0.50","0.50","0.50","0.50","0.50","0.50","0.50","0.50","--","0.50","0.50","0.50","0.50","0.50","0.50","0.50","0.50","0.50","0.50","0.50","0.50","0.50","0.50","0.50","0.50","0.50","0.50","0.50","0.50","--","--","--","--","--","0.50F"]
[16,"5801R","FE, Split Body, Reduced Port, Fire Safe, FE 150",null,null,"1-8, no 1.25,2.5","T, R, S, U","5",null,null,4,"0.75","0.75","0.75","0.75","0.75","0.75","0.75","0.75","--","0.75","0.75","0.75","0.75","0.75","0.75","--","0.75","0.75","0.75","0.75","0.75","0.75","0.75","0.75","0.75","0.75","0.75","0.75","0.75","--","--","--","--","--","0.75F",null,null,null,"Seat Material Menu (Table 3)"]
[17,"5801F","FE, Split Body, Full Port, Fire Safe, FE 150",null,null,".5-8, no 1.25, 2.5","T, R, S, U","5",null,null,5,"1.00","1.00","1.00","1.00","1.00","1.00","1.00","1.00","--","1.00","1.00","1.00","1.00","1.00","1.00","1.00","1.00","1.00","1.00","1.00","1.00","1.00","1.00","1.00","1.00","1.00","1.00","1.00","1.00","1.00","1.00","--","--","--","1.00F",null,null,null,"Menu","Horizontal Lookup Table"]
[18,"6000R","FE, Uni-body, Reduced Port, FE 300",null,null,".5-10, no 1.25, 2.5","T, R, S, U","5",null,null,6,"1.25","1.25","1.25","1.25","1.25","--","1.25","1.25","1.25","1.25","1.25","1.25","1.25","1.25","1.25","--","1.25","1.25","1.25","1.50","1.25","--","--","1.25","--","--","1.25","--","--","--","--","--","--","--","1.25F",null,null,null,{"$f":"G46","v":"T,R,S,U,D,P,CP"},"Row for","T,R,S,U,D,P,CP","T, R, S, D","T, R","T","R","R, S, U","T, R, S, U","D, P, CP","W5","D","Soft, Hard"]
[19,"6000F","FE, Uni-body ≤ 1\" / Split Body > 1\", Full Port, FE 300",null,null,".5-8, no 1.25, 2.5","T, R, S, U","5",null,null,7,"1.50","1.50","1.50","1.50","1.50","1.50","1.50","1.50","1.50","1.50","1.50","1.50","1.50","1.50","1.50","--","1.50","1.50","1.50","2.00","1.50","1.50","1.50","1.50","1.50","1.50","1.50","1.50","1.50","1.50","1.50","1.50","--","--","1.50F",null,null,1,{"$f":"HLOOKUP($G$46,$AZ$21:$BJ$33,2,FALSE)","v":"Teflon"},"Teflon","Teflon","Teflon","Teflon","Teflon","RPTFE","--","Teflon","--","--","--","--"]
[20,"6801F","FE, Split Body, Full Port, Fire Safe, FE 300",null,null,".5-8, no 1.25, 2.5","T, R, S, U","5",null,null,8,"2.00","2.00","--","2.00","2.00","2.00","2.00","2.00","2.00","2.00","2.00","2.00","2.00","2.00","--","2.00","2.00","2.00","2.00","2.50","2.00","2.00","2.00","2.00","2.00","2.00","2.00","2.00","2.00","2.00","2.00","2.00","2.00","--","2.00R",null,null,2,{"$f":"HLOOKUP($G$46,$AZ$21:$BJ$33,3,FALSE)","v":"RPTFE"},"RPTFE","RPTFE","RPTFE","RPTFE","--","--","RPTFE","RPTFE","--","--","--","--"]
[21,"CF8901F","3-Pc Cavity Filled, Full (Tube) Port, 1000 WOG / 150 WSP",null,null,".5-4, no 1.25","T","5",null,null,9,"2.50","2.50","--","--","--","--","2.50","2.50","2.50","--","--","2.50","2.50","2.50","--","--","--","2.50","2.50","3.00","2.50","2.50","2.50","2.50","2.50","--","2.50","2.50","--","--","--","2.50","2.50","--","--",null,null,3,{"$f":"HLOOKUP($G$46,$AZ$21:$BJ$33,4,FALSE)","v":"CRPTFE"},"CRPTFE","CRPTFE","CRPTFE","--","--","--","CRPTFE","CRPTFE","--","--","--","--"]
[22,"8700F","3-Pc, Full Port, 1000 WOG Dir Mt w/Lever / 150 WSP",null,null,".5 - 2","T, R, S, U","5",null,null,10,"3.00","3.00","--","--","--","--","--","3.00","3.00","3.00","3.00 x 2.00","3.00","3.00","3.00","--","--","--","--","3.00","--","3.00","3.00","3.00","3.00","3.00","3.00","3.00","3.00","3.00","3.00","3.00","3.00","3.00","3.00","--",null,null,4,{"$f":"HLOOKUP($G$46,$AZ$21:$BJ$33,5,FALSE)","v":"UHMW-PE"},"UHMW-PE","UHMW-PE","--","--","--","--","UHMW-PE","UHMW-PE","--","--","--","--"]
[23,"9000R","2-Pc Reduced Port, 1000 WOG",null,null,".5 - 2","R","4",null,null,11,"--","4.00","--","--","--","--","--","--","--","--","--","4.00","4.00","4.00","--","--","--","--","--","--","4.00","4.00","4.00","4.00","4.00","4.00","4.00","4.00","4.00","4.00","4.00","4.00","4.00","--","--",null,null,5,{"$f":"HLOOKUP($G$46,$AZ$21:$BJ$33,6,FALSE)","v":"Delrin"},"Delrin","Delrin","Delrin","--","--","--","--","--","Delrin","--","Delrin","--"]
[24,"9000F","2-Pc Full Port, 1000 WOG",null,null,".25 - 3","R","4",null,null,12,"--","6.00","--","--","--","--","--","--","--","--","--","--","6.00","6.00","--","--","--","--","--","--","--","--","6.00","6.00","6.00","6.00","6.00","6.00","6.00","--","6.00","--","6.00","--","--",null,null,6,{"$f":"HLOOKUP($G$46,$AZ$21:$BJ$33,7,FALSE)","v":"PEEK"},"PEEK","PEEK","--","--","--","--","--","--","PEEK","--","--","--"]
[25,9700,"9700 Series 2-Pc Seal Welded",null,null,"0.25F-1.5F, 2R","D","4",null,null,13,"--","8.00","--","--","--","--","--","--","--","--","--","--","--","--","--","--","--","--","--","--","--","--","--","8.00","8.00","8.00","8.00","8.00","8.00","--","8.00","--","--","--","--",null,null,7,{"$f":"HLOOKUP($G$46,$AZ$21:$BJ$33,8,FALSE)","v":"CPEEK"},"CPEEK","CPEEK","--","--","--","--","--","--","CPEEK","--","--","--"]
[26,"DM9000F","2-Pc Full Port, Direct Mount, 900 WOG",null,null,".5 - 2","T","4",null,null,14,"--","10.00","--","--","--","--","--","--","--","--","--","--","--","--","--","--","--","--","--","--","--","--","--","--","--","--","10.00","10.00","10.00","--","--","--","--","--","--",null,null,8,{"$f":"HLOOKUP($G$46,$AZ$21:$BJ$33,9,FALSE)","v":"--"},"MarWear CL4","--","--","--","--","--","--","--","--","--","--","--"]
[27,"10000F","3-Pc Full Port, 6200 WOG  ≤ 1.0 / 4300 WOG > 1.0",null,null,".25-3x2, no 2.5","D, P, CP","7",null,null,null,null,null,null,null,null,null,null,null,null,null,null,null,null,null,null,null,null,null,null,null,null,null,null,null,null,null,null,null,null,null,null,null,null,null,null,null,null,9,{"$f":"HLOOKUP($G$46,$AZ$21:$BJ$33,10,FALSE)","v":"--"},"MarWear CL5","--","--","--","--","--","--","--","--","MarWear Metal CL5","--","--"]
[28,"MS10000","3-Pc Metal Seated, Sch. 160 Port, 4500 WOG<=1.25 / 3700 WOG > 1.25",null,null,".25-3x2, no 2.5","W5","7",null,null,3,{"$f":"IF(Series<>\"Own\",VLOOKUP(K31,K16:L29,2,FALSE),\"Not Required\")","v":"0.50"},null,null,null,null,null,null,null,null,null,null,null,null,null,null,null,null,null,null,null,null,null,null,null,null,null,null,null,null,null,null,null,null,null,null,null,null,10,{"$f":"HLOOKUP($G$46,$AZ$21:$BJ$33,11,FALSE)","v":"--"},"Marwinite CL6","--","--","--","--","--","--","--","--","--","--","--"]
[29,"******3-Way*******","***************************************************************************",null,null,"*****************","************","*************",null,null,null,"Size",null,null,null,null,null,null,null,null,null,null,null,null,null,null,null,null,null,null,null,null,null,null,null,null,null,null,null,null,null,"was 1-6, no 1.25",null,null,null,null,null,null,11,{"$f":"HLOOKUP($G$46,$AZ$21:$BJ$33,12,FALSE)","v":"--"},"Soft","--","--","--","--","--","--","--","--","--","--","Soft"]
[30,"3L_or_3T_2100F_A","3-Way FE, Full Port NPT, Dir Mt w/Lever)",null,null,".5 - 4","R, S, U","4",null,null,null,null,null,null,null,null,null,null,null,null,null,null,null,null,null,null,null,null,null,null,null,null,null,null,null,null,null,null,null,null,null,null,null,null,null,null,null,null,12,{"$f":"HLOOKUP($G$46,$AZ$21:$BJ$33,13,FALSE)","v":"--"},"Hard","--","--","--","--","--","--","--","--","--","--","Hard"]
[31,"3L_or_3T_2100F_F","3-Way FE, Full Port, FE 150 (1/2\"-4\" Dir Mt w/Lever)",null,null,".5 - 6","R, S, U","4"]
[32,"3T3101F","3-Way Br. Bot. Entry, Full T-Port, Transflow Mix, 300 WOG (1/2\"-2\" DM w/Lever)",null,null,".25-3, no 2.5","T","4"]
[33,"3L3201F","3-Way Br. Bot. Entry, Full L-Port, Non-Transflow Divert, 300 WOG (1/2\"-2\" DM w/Lever)",null,null,".25-3, no 2.5","T","4",null,null,null,null,null,null,null,null,null,null,null,null,null,null,null,null,null,null,null,null,null,null,null,null,null,null,null,null,null,null,null,null,null,null,null,null,null,null,null,null,2,{"$f":"VLOOKUP($AW$36,$AW$22:$AX$33,2,FALSE)","v":"RPTFE"}]
[34,"3T3300R","3-Way Brass, Reduced T-Port, Dir Mt w/ Lever, 400 WOG",null,null,".25 - 2","R","4",null,null,null,null,null,null,null,null,null,null,null,null,null,null,null,null,null,null,null,null,null,null,null,null,null,null,null,null,null,null,null,null,null,null,null,null,null,null,null,null,null,"Seat"]
[35,"3L3400R","3-Way Brass, Reduced L-Port, Dir Mt w/ Lever, 400 WOG",null,null,".25 - 2","R","4"]
[36,"3T3700R","3-Way, Reduced T-Port, 800 WOG",null,null,".25 - 2","T","4",null,null,null,null,"Valve Note Table (Table 3A)",null,null,"N41:O56",null,null,null,null,null,null,null,"Automation Notes for Menu (Table 3B)",null,null,null,null,null,null,null,null,null,null,null,null,null,null,null,null,null,null,null,null,null,null,null,null,null,null,null,null,"End Open Torque Multiplier =  ",{"$f":"IF(OR(Seat=\"Teflon\", Seat=\"RPTFE\", Seat=\"CRPTFE\", Seat=\"Soft\"),0.8,1)","v":0.8}]
[37,"3L3800R","3-Way, Reduced L-Port, 800 WOG",null,null,".25 - 2","T","4",null,null,null,null,null,"Series","Note",null,null,null,null,null,null,null,null,"Ratio of Actuator Torque to Valve Required Torque",null,null,null,null,null,null,null,null,null,null,null,null,null,null,null,null,null,null,null,null,null,null,null,null,null,null,null,null,"Start Closed Torque Multiplier =  ",{"$f":"IF(OR(Seat=\"Teflon\", Seat=\"RPTFE\", Seat=\"CRPTFE\", Seat=\"Soft\"),0.9,1)","v":0.9}]
[38,"*******Own***********","***************************************************************************",null,null,"*****************","************","*************",null,null,null,null,1,"DM600F","Check if selected act. bolt pattern matches va. for direct mounting.",null,null,null,null,null,null,null,null,"ER","UT-DA","UT-SR","Spr. Hand","Gear Op.","Fus. Link",null,null,null,null,null,null,null,null,null,null,null,null,null,null,null,null,null,null,null,null,null,null,null,"End Closed Torque Multiplier =  ",{"$f":"IF(OR(Seat=\"Teflon\", Seat=\"RPTFE\", Seat=\"CRPTFE\", Seat=\"Soft\"),0.85,1)","v":0.85}]
[39,"Own","Input Own Valve Torque",null,null,"--","Soft, Hard","--",null,null,null,null,2,"DM9000F","Check if selected act. bolt pattern matches va. for direct mounting."]
[null,null,null,null,null,null,null,null,null,null,null,null,3,"4700F","Check if selected act. bolt pattern matches va. for direct mounting.",null,null,null,null,null,null,null,null,null,null,null,null,null,null,null,null,null,null,null,null,null,null,null,null,null,null,null,null,null,null,null,null,null,null,"Seat Mat'l Codes:  Teflon--T, RPTFE--R, CRPTFE (Starfill)--S, Delrin--D, PEEK--P, Carbon Filled Peek--CP, MarWear Class 4--M4, MarWear Class 6--M6,"]
[null,null,null,null,null,null,null,null,null,null,null,null,4,"8700F","Check if selected act. bolt pattern matches va. for direct mounting.",null,null,null,null,null,null,null,null,null,null,null,null,null,null,null,null,null,null,null,null,null,null,null,null,null,null,null,null,null,null,null,null,null,null,"Marwinite Class 6--W6"]
[null,null,null,null,null,null,null,null,null,null,null,null,5,"666F","No provisions for actuator mounting.",null,null,null,null,null,null,null,null,{"$f":"Menu!H29","v":1.7391304347826086},{"$f":"Menu!Q29","v":1.5565217391304347},{"$f":"Menu!H42","v":1.8846153846153846},{"$f":"#REF!","v":{"$error":"#REF!"}},{"$f":"Menu!Q43","v":39.130434782608695},{"$f":"#REF!","v":{"$error":"#REF!"}}]
[9,{"$f":"VLOOKUP($A$46,$A$4:$H$42,2, FALSE)","v":"3000F"},{"$f":"VLOOKUP($A$46,$A$4:$H$42,3, FALSE)","v":"3-Pc Fire Safe, Full Port, 3000 WOG"},null,null,{"$f":"VLOOKUP($A$46,$A$4:$H$42,6, FALSE)","v":".25 - 3"},{"$f":"VLOOKUP($A$46,$A$4:$H$42,7, FALSE)","v":"T,R,S,U,D,P,CP"},{"$f":"VLOOKUP($A$46,$A$4:$H$42,8, FALSE)","v":"7"},null,null,null,null,6,"666R","No provisions for actuator mounting.",null,null,null,null,null,null,null,null,null,null,{"$f":"Menu!H43","v":1.1326530612244898},{"$f":"#REF!","v":{"$error":"#REF!"}}]
[null,"Series",null,null,null,null,null,null,null,null,null,null,7,"9000F","Automation not recommended for 1.25\" - 2.5\" 9000F",null,null,null,null,null,null,null,null,null,null,{"$f":"Menu!H44","v":1.6782608695652175}]
[null,null,null,null,null,null,null,null,null,null,null,null,8,"3T3300R","Check if selected act. bolt pattern matches va. for direct mounting.",null,null,null,null,null,null,null,null,null,null,{"$f":"Menu!H45","v":1.0326086956521738}]
[null,null,null,null,null,null,null,null,null,null,null,null,9,"3L3400R","Check if selected act. bolt pattern matches va. for direct mounting.",null,null,null,null,null,null,null,null,"Act.","Act.: Va. Torq. Too Low",null,null,null,null,null,null,null,"Act.: Va. Torq. OK"]
[null,null,null,null,null,null,null,null,null,null,null,null,10,"3T3101F","180 Deg. rotation required for automation",null,null,null,null,null,null,null,null,"ER",{"$f":"CONCATENATE(\"Act.:Req. Torq. = \",ROUND(X45,2),\" < 1.0; MAY BE TOO LOW FOR AUTOMATION!\")","v":"Act.:Req. Torq. = 1.74 < 1.0; MAY BE TOO LOW FOR AUTOMATION!"},null,null,null,null,null,null,null,{"$f":"CONCATENATE(\"Act.:Req. Torque = \",ROUND(X45,2),\" > 1.0 OK for Automation (Note 4)\")","v":"Act.:Req. Torque = 1.74 > 1.0 OK for Automation (Note 4)"},null,null,null,null,null,{"$f":"text","v":{"$error":"#NAME?"}}]
[null,null,null,null,null,null,null,null,null,null,null,null,11,"3L3201F","180 Deg. rotation required for automation",null,null,null,null,null,null,null,null,"UT-DA",{"$f":"CONCATENATE(\"Act.:Req. Torq. = \",ROUND(Y45,2),\" < 1.0; MAY BE TOO LOW FOR AUTOMATION!\")","v":"Act.:Req. Torq. = 1.56 < 1.0; MAY BE TOO LOW FOR AUTOMATION!"},null,null,null,null,null,null,null,{"$f":"CONCATENATE(\"Act.:Req. Torque = \",ROUND(Y45,2),\" > 1.0 OK for Automation (Note 4)\")","v":"Act.:Req. Torque = 1.56 > 1.0 OK for Automation (Note 4)"}]
[null,null,null,null,null,null,null,null,null,null,null,null,12,"5800R","10\" 5800R standard w/ Gear Op. & 23.6 in. D. Hwl.",null,null,null,null,null,null,null,null,"UT-SR",{"$f":"CONCATENATE(\"Act.:Req. Torq. = \",ROUND(MIN(Z45:Z48),2),\" < 1.0 MAY BE TOO LOW FOR AUTOMATION!\")","v":"Act.:Req. Torq. = 1.03 < 1.0 MAY BE TOO LOW FOR AUTOMATION!"},null,null,null,null,null,null,null,{"$f":"CONCATENATE(\"Act.:Req. Torque = \",ROUND(MIN(Z45:Z48),2),\" > 1.0 OK for Automation (Note 4)\")","v":"Act.:Req. Torque = 1.03 > 1.0 OK for Automation (Note 4)"}]
[null,null,null,null,null,null,null,null,null,null,null,null,13,"5800F","8\" 5800F standard w/ Gear Op. & 23.6 in. D. Hwl.",null,null,null,null,null,null,null,null,"Gear Op."]
[null,null,null,null,null,null,null,null,null,null,null,null,14,"6800R","8\" & 10\" 6800R standard w/ Gear Op. & 23.6 in. D. Hwl.",null,null,null,null,null,null,null,null,"Spr. Hand",{"$f":"CONCATENATE(\"Warning!  Act.:Req. Torq. = \",ROUND(MIN(AA45:AA46),2),\" < 1.0 TOO LOW FOR AUTOMATION!\")","v":{"$error":"#REF!"}},null,null,null,null,null,null,null,{"$f":"CONCATENATE(\"Act.:Req. Torque = \",ROUND(MIN(AA45:AA46),2),\" >1.0 OK for Automation (Use 1.5 SF)\")","v":{"$error":"#REF!"}}]
[null,null,null,null,null,null,null,null,null,null,null,null,15,"6800F","6\" & 8\"  6800F standard w/ Gear Op. & 23.6 in. D. Hwl.",null,null,null,null,null,null,null,null,"Fus. Link",{"$f":"CONCATENATE(\"Warning!  Act.:Req. Torq. = \",ROUND(AC45,2),\" < 1.5 TOO LOW FOR FUS. Link!\")","v":{"$error":"#REF!"}},null,null,null,null,null,null,null,{"$f":"CONCATENATE(\"Act.:Req. Torque = \",ROUND(AC45,2),\" >1.5 OK for FUS. LINK\")","v":{"$error":"#REF!"}}]
[null,null,null,null,null,null,null,null,null,null,null,null,16]
[]
[]
[null,null,"Va. Table (Va_Table) =  ",{"$f":"CONCATENATE(\"_\",Series)","v":"_3000F"},null,null,null,null,null,null,null,null,null,{"$f":"VLOOKUP($B$46,$N$41:$O$56,2, FALSE)","v":{"$error":"#N/A"}}]
[null,null,"Va. Seat Mat'l (Seat) =  ",{"$f":"Seat","v":"RPTFE"},null,null,null,null,null,null,null,null,null,{"$f":"IF(ISERROR(N59),\"\",N59)","v":""}]
[null,null,"Seat Col. in Torque Tables:  ",{"$f":"HLOOKUP(Seat,INDIRECT(Va_Table),2,FALSE)","v":3}]
[null,null,"Va. Table Break Open Torque (Torq) =  ",{"$f":"IF(Series<>\"Own\",VLOOKUP(Size,INDIRECT(Va_Table),Va!$D$61,FALSE),Menu!$K$11)","v":96},"lbf-in."]
[null,null,"Service Factor (SF) =  ",{"$f":"D84","v":1.2},"--",{"$f":"CONCATENATE(\"Based on \",C84)","v":"Based on Clean & 2 or More cycle / day ..................................... 1.2"}]
[null,null,"Va. Start (Break) Open Torque (SOT) =  ",{"$f":"ROUND(Torq*SF,0)","v":115},"lbf-in.","Service Factor x Va. Break Open Torque (Required Torque)"]
[null,null,"Va. End Open Torque (EOT)=  ",{"$f":"ROUND(SOT*BB39,0)","v":92},"lbf-in.",{"$f":"CONCATENATE(\"Based on \",BB39,\" End Open Torque Multiplier for \",Seat)","v":"Based on 0.8 End Open Torque Multiplier for RPTFE"}]
[null,null,"Va. Start Closed Torque (SCT) =  ",{"$f":"ROUND(SOT*BB40,0)","v":104},"lbf-in.",{"$f":"CONCATENATE(\"Based on \",BB40,\" Start Closed Torque Multiplier for \",Seat)","v":"Based on 0.9 Start Closed Torque Multiplier for RPTFE"}]
[null,null,"Va. End Closed Torque (ECT) =  ",{"$f":"ROUND(SOT*BB41,0)","v":98},"lbf-in.",{"$f":"CONCATENATE(\"Based on \",BB41,\" End Closed Torque Multiplier for \",Seat)","v":"Based on 0.85 End Closed Torque Multiplier for RPTFE"}]
[null,null,"Torque Function of Press (WOG):  ",{"$f":"IF(Series<>\"Own\",VLOOKUP(Size,INDIRECT(Va_Table),Va!$D$61+H46,FALSE),\"NA\")","v":"NA"},"psi"]
[null,null,"Mounting:  ",{"$f":"IF(Series<>\"Own\",VLOOKUP(Size,INDIRECT(Va_Table),H46*2+2,FALSE),\"\")","v":"Bckt & Cplgr"},"--"]
[null,null,"Dir. Mt. Va. Mounting Pattern:  ",{"$f":"IF(Series<>\"Own\",VLOOKUP(Size,INDIRECT(Va_Table),H46*2+3,FALSE),\"\")","v":"F03"},"mm"]
[null,null,"Dir. Mt. Va. Stem Sq.:  ",{"$f":"IF(Series<>\"Own\",VLOOKUP(Size,INDIRECT(Va_Table),H46*2+4,FALSE),\"\")","v":5.44}]
[]
["Service Factor Menu (Table 4)"]
[]
[null,1,"Clean, & 10 or More cycle / day .................................. 1.0",1]
[null,2,"Clean & 2 or More cycle / day ..................................... 1.2",1.2]
[null,3,"Clean & Less Than 2 cycle / day .................................. 1.5",1.5]
[null,4,"Clean & Throttling ...................................................... 1.5",1.5]
[null,5,"Dry, Dirty, Slurry, or Cryo, & 2 or More cycle / day ....... 1.5",1.5]
[null,6,"Dry, Dirty, Slurry, or Cryo, & Less Than 2 cycle / day ... 1.75 ",1.75]
[null,7,"Dry, Dirty, Slurry, or Cryo, & Throttling ........................ 1.75",1.75]
[null,8,"Emer. Shutoff or Less Than 1 cycle / mo ....................... 2.0",2]
[]
[null,2,{"$f":"VLOOKUP($B$84,$B$75:$D$82,2,FALSE)","v":"Clean & 2 or More cycle / day ..................................... 1.2"},{"$f":"VLOOKUP($B$84,$B$75:$D$82,3,FALSE)","v":1.2}]

{"sheet":"DA","index":5,"n_rows":56,"n_cols":33,"rows_kept":56,"cut":false,"hidden":true,"merged":[[4,2,4,14],[42,2,42,14],[4,0,4,1],[35,27,35,28],[36,27,36,28],[37,27,37,28],[42,0,42,1],[4,18,4,19],[15,18,15,19],[42,18,42,19]]}
["Direct Acting Pnuematic Actuator"]
[]
[null,null,null,null,null,null,null,"DA_Pneu_Act",null,"This table not valid; data removed, but 1st and last lines left to maintain program functionality for future alternate actuator."]
["D. A. Pneumatic Act. Data Table (Table 6A)",null,null,null,null,null,null,"A7:P10",null,null,null,null,null,null,null,null,null,null,null,null,null,null,"D. A. Press. Sel. Menu (Table 9)",null,null,null,null,"Actuator Version"]
["Torque Range",null,"Pneumatic Actuator Torque Information - Double Acting (lbf-in.)",null,null,null,null,null,null,null,null,null,null,null,null,"Act. >=","Mount","Stem","Cycle Time, s",null,"Lookup",null,null,"Menu",null,null,null,null,"Menu"]
["Min","Max","Model No.","Valbia ID","Size Ord.","40 PSI","50 PSI","60 PSI","70 PSI","80 PSI","90 PSI","100 PSI","115 PSI","130 PSI","140 psi","Va. Open",null,"Sq.","CCW","CW","Row No.",null,1,"40 PSI",null,null,null,1,"Old / Unchanged UT"]
[{"$f":"B6+1","v":{"$error":"#VALUE!"}},{"$f":"HLOOKUP($X$17,$C$6:$O$10,U7,FALSE)","v":209.1},"UT-0-DA","DA 52",2,104.5,130.69999999999999,156.80000000000001,182.9,209.1,235.2,261.3,300.5,339.7,365.8,{"$f":"AND(B7>=SOT)","v":true},"F03/F05",11,null,null,2,null,2,"50 PSI",null,null,null,2,"New UT"]
[0,{"$f":"HLOOKUP($X$17,$C$6:$O$10,U8,FALSE)","v":25469},"UT-7-DA","DA 270",11,12734,15919,19097,22284,25469,28654,31832,36611,41382,44565,{"$f":"AND(B8>=SOT)","v":true},"F16",46,null,null,3,null,3,"60 PSI",null,null,null,3,"Automatic"]
[{"$f":"B8+1","v":25470},{"$f":"HLOOKUP($X$17,$C$6:$O$10,U9,FALSE)","v":99999},"Consult Eng.",null,12,99999,99999,99999,99999,99999,99999,99999,99999,99999,99999,{"$f":"AND(B9>=SOT)","v":true},"--","--",null,null,4,null,4,"70 PSI"]
[{"$f":"B9+1","v":100000},{"$f":"HLOOKUP($X$17,$C$6:$O$10,U10,FALSE)","v":71},"UT-0A-DA","DA 32",1,34,43,55,64,71,82,87,101,114,123,{"$f":"AND(B10>=SOT)","v":false},"F03",9,null,null,5,null,5,"80 PSI",null,2,null,2,{"$f":"VLOOKUP(AB10,AB6:AC8,2,FALSE)","v":"New UT"}]
[null,null,null,null,null,null,null,null,null,null,null,null,null,null,null,null,null,null,null,null,null,null,6,"90 PSI"]
[null,null,null,null,null,null,null,null,null,null,null,null,null,null,null,null,null,null,null,null,null,null,7,"100 PSI"]
[null,null,null,null,null,null,null,null,null,null,null,null,null,null,null,null,null,null,null,null,null,null,8,"115 PSI"]
[null,null,null,null,null,null,null,"DA_Pneu_Act_New",null,null,null,null,null,null,null,null,null,null,null,null,null,null,9,"130 PSI"]
["New D. A. Pneumatic Act. Data Table (Table 6B)",null,null,null,null,null,null,"A18:P32",null,null,null,null,null,null,null,null,null,null,null,null,null,null,10,"140 psi"]
["Torque Range",null,"Pneumatic Actuator Torque Information - Double Acting (lbf-in.)",null,null,null,null,null,null,null,null,null,null,null,null,"Act. >=","Mount","Stem","Cycle Time, s",null,"Lookup"]
["Min","Max","Model No.","Valbia ID","Size Ord.","40 PSI","50 PSI","60 PSI","70 PSI","80 PSI","90 PSI","100 PSI","115 PSI","130 PSI","140 psi","Va. Open",null,"Sq.","CCW","CW",5,null,5,{"$f":"VLOOKUP(W17,W6:X15,2,FALSE)","v":"80 PSI"}]
[{"$f":"B17+1","v":{"$error":"#VALUE!"}},{"$f":"HLOOKUP($X$17,$C$17:$O$32,U18,FALSE)","v":179},"UT-0-DA","DA 52",2,86,110,133,156,179,203,226,261,303,326,{"$f":"AND(B18>=SOT)","v":true},"F03/F05",11,7.0000000000000007E-2,0.05,2]
[180,321,"UT-1-DA","DA 63",3,154,196,238,280,321,363,405,468,536,577,true,"F05/F07",14,0.11,0.1,3]
[322,586,"UT-2-DA","DA 75",4,284,360,435,511,586,661,737,850,965,1039,true,"F05/F07",17,0.18,0.15,4]
[587,851,"UT-2.5-DA","DA 85",5,408,518,629,740,851,962,1072,1238,1374,1480,true,"F05/F07",17,0.36,0.25,5]
[852,1334,"UT-3-DA","DA 100",6,646,818,991,1163,1334,1508,1681,1939,2168,2335,true,"F05/F07",17,0.38,0.34,6]
[1335,2210,"UT-3.5-DA","DA 115",7,1070,1355,1640,1925,2210,2495,2780,3208,3570,3844,true,"F07/F10",22,0.6,0.54,7,null,null,"UT-6.5","DA 230",8585.3714,10730.7714,12876.171399999999,15021.571399999999,17166.971400000002,19312.3714,21457.771400000001,24675.8714]
[2211,2906,"UT-4-DA","DA 125",8,1409,1780,2157,2532,2906,3280,3654,4216,4628,4984,true,"F07/F10",22,0.8,0.7,8,null,null,"DA 330",22460.572400000001,28075.072400000005,33689.572399999997,39304.072399999997,44918.572399999997,50533.072400000005,56147.572400000005,64569.322400000005]
[2907,4008,"UT-4.5-DA","DA 140",9,2001,2503,3005,3506,4008,4510,5012,5765,{"$f":"NA()","v":{"$error":"#N/A"}},{"$f":"NA()","v":{"$error":"#N/A"}},true,"F10/F12",27,1.1299999999999999,0.94,9]
[{"$f":"B24+1","v":2907},5859,"UT-5-DA","DA 160",10,2930,3662,4394,5127,5859,6591,7324,8422,9521,10254,true,"F10/F12",27,1.43,1.25,10]
[{"$f":"B26+1","v":5860},10981,"UT-6-DA","DA 200",11,5488,6866,8239,9612,10981,12359,13732,15792,17852,19225,true,"F14",36,3.08,2.41,11]
[{"$f":"B26+1","v":5860},17166.971400000002,"UT-6.5-DA","DA 230",12,8585.3714,10730.7714,12876.171399999999,15021.571399999999,17166.971400000002,19312.3714,21457.771400000001,24675.8714,null,null,true,"F16",46,4.1500000000000004,3.8,12]
[{"$f":"B27+1","v":10982},25469,"UT-7-DA","DA 270",13,12734,15919,19097,22284,25469,28654,31832,36611,41382,44565,true,"F16",46,6.2,5.5,13]
[{"$f":"B29+1","v":25470},44918.572399999997,"UT-7.5-DA","DA 330",14,22460.572400000001,28075.072400000005,33689.572399999997,39304.072399999997,44918.572399999997,50533.072400000005,56147.572400000005,64569.322400000005,null,null,true,"F16/F25",55,7.3,8.1999999999999993,14]
[{"$f":"B30+1","v":44919.572399999997},99999,"Consult Eng.",null,15,99999,99999,99999,99999,99999,99999,99999,99999,99999,99999,true,"--","--","--","--",15]
[0,71,"UT-0A-DA","DA 32",1,34,43,55,64,71,82,87,101,114,123,false,"F03",9,0.03,0.03,16]
["New Valbia Model DA (Valbia Cat. 028/A p12)",null,null,null,null,null,null,null,null,null,null,null,null,"Calc.","Calc."]
[]
[]
["Red Italics --  Calculated from 100 psi torque;  Valbia did not give torque for new design above 115 psi.",null,null,null,null,null,null,null,null,null,null,null,null,null,null,null,null,null,null,null,null,null,null,null,null,null,null,"Old or New UT"]
[null,null,null,null,null,null,null,null,null,null,null,null,null,null,null,null,null,null,null,null,null,null,null,null,null,null,null,"Actuator"]
[null,null,null,null,null,null,null,null,null,null,null,null,null,null,null,null,null,null,null,null,null,null,null,null,null,null,null,"Selection"]
[]
[]
[]
["D. A. Pneumatic Act. Selection Table (Table  6C)",null,null,null,null,{"$f":"CHOOSE($AB$10,H3,H14)","v":"DA_Pneu_Act_New"},null,null,null,null,null,null,null,null,null,null,null,null,null,null,null,null,null,null,null,null,null,"This needs to be put"]
["Torque Range",null,"Pneumatic Actuator Torque Information - Double Acting (lbf-in.)",null,null,null,null,null,null,null,null,null,null,null,null,null,"Mount","Stem","Cycle Time, s",null,null,null,null,null,null,null,null,"on Menu sheet if user"]
["Min","Max","Model No.","UT size","Size Ord.","40 PSI","50 PSI","60 PSI","70 PSI","80 PSI","90 PSI","100 PSI","115 PSI","130 PSI","140 psi",null,null,"Sq.","CCW","CW",null,null,null,null,null,null,null,"must select from"]
[{"$f":"CHOOSE($AB$10,A7,A18)","v":{"$error":"#VALUE!"}},179,"UT-0-DA","DA 52",2,86,110,133,156,179,203,226,261,303,326,null,{"$f":"CHOOSE($AB$10,Q7,Q18)","v":"F03/F05"},{"$f":"CHOOSE($AB$10,R7,R18)","v":11},{"$f":"CHOOSE($AB$10,S7,S18)","v":7.0000000000000007E-2},0.05,null,null,null,null,null,null,null,"multiple actuator"]
[null,null,null,null,null,null,null,null,null,null,null,null,null,null,null,null,null,null,null,null,null,null,null,null,null,null,null,"brands."]
[]
[null,null,null,null,null,null,null,null,null,null,null,null,null,null,null,null,"DA Actuator Note Table",null,null,"R48:S50"]
[null,null,null,null,null,null,null,null,null,null,null,null,null,null,null,null,null,"Actuator","Note"]
[null,null,null,null,null,null,null,null,null,null,null,null,null,null,null,null,1,"UT-6.5-DA","Non-stock; consult factory."]
[null,null,null,null,null,null,null,null,null,null,null,null,null,null,null,null,2,"UT-7.5-DA","Non-stock; consult factory."]
[null,null,null,null,null,null,null,null,null,null,null,null,null,null,null,null,3]
[]
[]
[null,null,null,null,null,null,null,null,null,null,null,null,null,null,null,null,{"$f":"VLOOKUP($C$45,$R$50:$S$52,2, FALSE)","v":{"$error":"#N/A"}}]
[null,null,null,null,null,null,null,null,null,null,null,null,null,null,null,null,{"$f":"IF(ISERROR(Q55),\"\",Q55)","v":""}]

{"sheet":"SR","index":6,"n_rows":153,"n_cols":70,"rows_kept":153,"cut":false,"hidden":true,"merged":[[49,39,49,40],[9,39,9,40],[132,19,132,20],[132,21,132,22],[51,45,51,46],[26,45,26,46],[3,51,3,59],[4,51,4,59],[43,51,43,59],[44,51,44,59],[11,45,11,46],[8,25,8,29],[9,21,9,22],[131,32,132,32],[8,30,8,34],[67,45,67,46],[132,23,132,24],[48,25,48,29],[48,30,48,34],[131,26,131,27],[131,29,131,31],[8,2,8,24],[9,9,9,10],[132,17,132,18],[132,7,132,8],[132,9,132,10],[132,11,132,12],[49,11,49,12],[49,21,49,22],[49,13,49,14],[49,23,49,24],[49,15,49,16],[49,17,49,18],[49,19,49,20],[132,13,132,14],[132,15,132,16],[8,0,8,1],[48,2,48,24],[9,7,9,8],[48,0,48,1],[9,13,9,14],[9,11,9,12],[9,23,9,24],[9,15,9,16],[9,17,9,18],[9,19,9,20],[131,0,131,1],[131,2,131,24],[49,7,49,8],[49,9,49,10]]}
["Spring Return Pneumatic Actuator"]
[]
[null,null,null,null,null,null,null,null,null,null,null,null,null,null,null,null,null,null,null,null,null,null,null,null,null,null,null,null,null,null,null,null,null,null,null,"All FC > Req","All FO > Req",null,null,null,null,null,null,"Valve Start (Break) Open Torque  -->  Start Open from Closed Position"]
[null,null,null,null,null,null,null,null,null,null,null,null,null,null,null,null,null,null,null,null,null,null,null,null,null,null,null,null,null,null,null,null,null,null,null,"Spr. Start >=","Spr. Start >=",null,null,null,null,null,null,"Valve End Open Torque --> End Open from Closed Position",null,null,null,null,null,null,null,"Fail Safe Spring Return Pneumatic Actuator",null,null,null,null,null,null,null,null,null,null,null,"S. R. Pneumatic Act. Press.",null,null,null,null,"S. R. Pneumatic Act. Failure"]
[null,null,null,null,null,null,null,null,null,null,null,null,null,null,null,null,null,null,null,null,null,null,null,null,null,null,null,null,null,null,null,null,null,null,null,"Start Closed","Start Open",null,null,null,null,null,null,"Valve Start Closed Torque --> Start Closed from Open Position",null,null,null,null,null,null,null,{"$f":"BB28","v":"Torque vs. Va. Position -- Fail Closed"},null,null,null,null,null,null,null,null,null,null,null,"Sel. Menu (Table 10)",null,null,null,null,"Mode Menu (Table 11)"]
[null,null,null,null,null,null,null,null,null,null,null,null,null,null,null,null,null,null,null,null,null,null,null,null,null,null,null,null,null,null,null,null,null,null,null,"Spr. End >=","Spr. End >=",null,null,null,null,null,null,"Valve End Closed Torque --> End Closed from Open Position",null,null,null,null,null,null,null,null,null,null,null,null,null,null,null,null,null,null,null,null,"Menu"]
[null,null,null,null,null,null,null,null,null,"FS_Pneu_Act",null,"This table not valid; data removed, but 1st and last lines left to maintain program functionality for future alternate actuator.",null,null,null,null,null,null,null,null,null,null,null,null,null,null,null,null,null,null,null,null,null,null,null,"End Closed","End Open",null,null,null,null,null,null,null,null,null,null,null,null,null,null,null,null,null,null,null,null,null,null,null,null,null,null,1,"40 PSI",null,null,null,1,"Fail Closed"]
["Old Spring Return Pneumatic Act. Data Table (Table 7A)",null,null,null,null,null,null,null,null,"A12:AA67",null,null,"Old SR Pneumatic Act.",null,null,null,null,null,null,null,null,null,null,null,null,null,"Old SR Pneumatic Act.",null,null,null,null,null,null,null,null,"Air Start >=","Air Start >=",null,null,null,null,null,null,null,null,null,null,null,null,null,null,null,null,null,null,null,null,null,null,null,null,null,null,2,"50 PSI",null,null,null,2,"Fail Open"]
[{"$f":"CONCATENATE(\"Air Torq. @ \",$BM$16)","v":"Air Torq. @ 80 PSI"},null,"\"Old\" Spring Return Pneumatic Act. Torque (lbf-in.) - Sorted by True / False, Act. Size, Min. Torque Ratio",null,null,null,null,null,null,null,null,null,null,null,null,null,null,null,null,null,null,null,null,null,null,"Fail Close Act. : Va. Required Torque Ratio",null,null,null,null,"Fail Open Act. : Va. Required Torque Ratio",null,null,null,null,"Start Open","Start Closed",null,null,null,null,null,null,null,null,null,null,null,null,null,null,null,null,null,null,null,null,null,null,null,null,null,null,3,"60 PSI"]
["Start","End","Model No.","Valbia ID","UT No.","Spring","Spr. Set","Spring Torque",null,"40 PSI",null,"50 PSI",null,"60 PSI",null,"70 PSI",null,"80 PSI",null,"90 PSI",null,"100 PSI",null,"115 PSI",null,"Spr. Start","Spr. End","Air Start","Air End","Min","Spr. Start","Spr. End","Air Start","Air End","Min","Air End >=","Air End >=","Mount","Stem","Cycle Time, s",null,"Lookup",null,null,null,null,null,null,null,null,"Act: ",null,null,null,null,null,null,null,null,null,null,null,null,4,"70 PSI",null,1,null,1,{"$f":"VLOOKUP(BQ10,BQ7:BR8,2,FALSE)","v":"Fail Closed"}]
[{"$f":"CONCATENATE($BM$17,\"_Start\")","v":"80_Start"},{"$f":"CONCATENATE($BM$17,\"_End\")","v":"80_End"},null,null,null,"Set","No.","Start","End","40_Start","40_End","50_Start","50_End","60_Start","60_End","70_Start","70_End","80_Start","80_End","90_Start","90_End","100_Start","100_End","115_Start","115_End","SCT","ECT","SOT","EOT",null,"SOT","EOT","SCT","ECT",null,"End Open","End Closed",null,"Sq.","CCW","CW","Row No.",null,"Fail Close",null,null,null,null,null,"Req.","Req : Va",null,null,null,null,null,null,null,null,null,null,null,null,5,"80 PSI"]
[{"$f":"HLOOKUP($A$11,$C$11:$Y$13,AP12,FALSE)","v":3452},{"$f":"HLOOKUP($B$11,$C$11:$Y$13,AP12,FALSE)","v":2240},"UT-5-SR-05","SR 160",5,"72.6-87",5,3327,2230,"-","-","-","-","-","-",2737,1507,3452,2240,4175,2963,"-","-","-","-",{"$f":"H12/SCT","v":31.990384615384617},{"$f":"I12/ECT","v":22.755102040816325},{"$f":"A12/SOT","v":30.017391304347825},{"$f":"B12/EOT","v":24.347826086956523},{"$f":"MIN(Z12:AC12)","v":22.755102040816325},{"$f":"H12/SOT","v":28.930434782608696},{"$f":"I12/EOT","v":24.239130434782609},{"$f":"A12/SCT","v":33.192307692307693},{"$f":"B12/ECT","v":22.857142857142858},{"$f":"MIN(AE12:AH12)","v":22.857142857142858},{"$f":"AND(H12>=SCT,I12>=ECT,A12>=SOT,B12>=EOT,A12<>\"-\",B12<>\"-\")","v":true},{"$f":"AND(H12>=SOT,I12>=EOT,A12>=SCT,B12>=ECT,A12<>\"-\",B12<>\"-\")","v":true},"F10/F12",27,null,null,2,null,"Stroke Cell",null,"Act. Stroke",null,"Act Torq","Compare","Va Torq","Ratio",null,null,null,null,null,null,null,null,null,null,null,null,6,"90 PSI"]
[{"$f":"HLOOKUP($A$11,$C$11:$Y$13,AP13,FALSE)","v":"-"},{"$f":"HLOOKUP($B$11,$C$11:$Y$13,AP53,FALSE)","v":"-"},"UT-7-SR-01","SR 270",7,40,1,6973,4469,8574,6017,11883,9317,15309,12743,"-","-","-","-","-","-","-","-","-","-",{"$f":"H13/SCT","v":67.04807692307692},{"$f":"I13/ECT","v":45.602040816326529},{"$f":"A13/SOT","v":{"$error":"#VALUE!"}},{"$f":"B13/EOT","v":{"$error":"#VALUE!"}},{"$f":"MIN(Z13:AC13)","v":{"$error":"#VALUE!"}},{"$f":"H13/SOT","v":60.634782608695652},{"$f":"I13/EOT","v":48.576086956521742},{"$f":"A13/SCT","v":{"$error":"#VALUE!"}},{"$f":"B13/ECT","v":{"$error":"#VALUE!"}},{"$f":"MIN(AE13:AH13)","v":{"$error":"#VALUE!"}},{"$f":"AND(H13>=SCT,I13>=ECT,A13>=SOT,B13>=EOT,A13<>\"-\",B13<>\"-\")","v":false},{"$f":"AND(H13>=SOT,I13>=EOT,A13>=SCT,B13>=ECT,A13<>\"-\",B13<>\"-\")","v":false},"F16",46,null,null,3,null,"H12",null,null,"Spr. Start Torque =  ",{"$f":"$H$12","v":3327},">= Start Closed",{"$f":"SCT","v":104},{"$f":"AV13/AX13","v":31.990384615384617},null,null,null,null,null,null,null,null,null,null,null,null,7,"100 PSI"]
[null,null,null,null,null,null,null,null,null,null,null,null,null,null,null,null,null,null,null,null,null,null,null,null,null,null,null,null,null,null,null,null,null,null,null,null,null,null,null,null,null,null,null,"I12",null,null,"Spr. End Torque =  ",{"$f":"$I$12","v":2230},">= End Closed",{"$f":"ECT","v":98},{"$f":"AV14/AX14","v":22.755102040816325},null,null,null,null,null,null,null,null,null,null,null,null,8,"115 PSI"]
[null,null,null,null,null,null,null,null,null,null,null,null,null,null,null,null,null,null,null,null,null,null,null,null,null,null,null,null,null,null,null,null,null,null,null,null,null,null,null,null,null,null,null,"A12",null,null,"Air Start Torque =  ",{"$f":"$A$12","v":3452},">= Start Open",{"$f":"SOT","v":115},{"$f":"AV15/AX15","v":30.017391304347825}]
[null,null,null,null,null,null,null,null,null,null,null,null,null,null,null,null,null,null,null,null,null,null,null,null,null,null,null,null,null,null,null,null,null,null,null,null,null,null,null,null,null,null,null,"B12",null,null,"Air End Torque = ",{"$f":"$B$12","v":2240},">= End Open",{"$f":"EOT","v":92},{"$f":"AV16/AX16","v":24.347826086956523},null,null,null,null,null,null,null,null,null,null,5,null,5,{"$f":"VLOOKUP(BL16,BL7:BM14,2,FALSE)","v":"80 PSI"}]
[null,null,null,null,null,null,null,null,null,null,null,null,null,null,null,null,null,null,null,null,null,null,null,null,null,null,null,null,null,null,null,null,null,null,null,null,null,null,null,null,null,null,null,null,null,null,"Min. FC Act Torque =",{"$f":"MIN(AV13:AV16)","v":2230},"Min. FC Req : Va",null,{"$f":"MIN(AY13:AY16)","v":22.755102040816325},null,null,null,null,null,null,null,null,null,null,null,null,null,{"$f":"LEFT($BM$16,LEN($BM$16)-4)","v":"80"},"text"]
[null,null,null,null,null,null,null,null,null,null,null,null,null,null,null,null,null,null,null,null,null,null,null,null,null,null,null,null,null,null,null,null,null,null,null,null,null,null,null,null,null,null,null,"F.C. Information for S.R. Pneumatic Act.",null,null,null,null,null,null,null,null,null,null,null,null,null,null,null,null,null,null,null,null,{"$f":"IF(VALUE(BM17)<60,40,IF(VALUE(BM17)<80,60,80))","v":80},"number"]
[null,null,null,null,null,null,null,null,null,null,null,null,null,null,null,null,null,null,null,null,null,null,null,null,null,null,null,null,null,null,null,null,null,null,null,null,null,null,null,null,null,null,null,"Vs. Va. Torque Comparison (Table 7B)"]
[null,null,null,null,null,null,null,null,null,null,null,null,null,null,null,null,null,null,null,null,null,null,null,null,null,null,null,null,null,null,null,null,null,null,null,null,null,null,null,null,null,null,null,{"$f":"IF($H$12>SCT,$H$12&\" Spr. Start >= \"&SCT&\" Start Closed  --  OK\", $H$12&\" Spr. Start < \"&SCT&\" Start Closed --  Not OK\")","v":"3327 Spr. Start >= 104 Start Closed  --  OK"},null,null,null,null,"AD20:AD23"]
[null,null,null,null,null,null,null,null,null,null,null,null,null,null,null,null,null,null,null,null,null,null,null,null,null,null,null,null,null,null,null,null,null,null,null,null,null,null,null,null,null,null,null,{"$f":"IF($I$12>ECT,$I$12&\" Spr. End  >= \"&ECT&\" End Closed -- OK\", $I$12&\" Spr. End  < \"&ECT&\" End Closed -- Not OK\")","v":"2230 Spr. End  >= 98 End Closed -- OK"}]
[null,null,null,null,null,null,null,null,null,null,null,null,null,null,null,null,null,null,null,null,null,null,null,null,null,null,null,null,null,null,null,null,null,null,null,null,null,null,null,null,null,null,null,{"$f":"IF($A$12>SOT,$A$12&\" Air Start  >=  \"&SOT&\" Start Open -- OK\",$A$12&\" Air Start  <  \"&SOT&\" Start Open -- Not OK\")","v":"3452 Air Start  >=  115 Start Open -- OK"}]
[null,null,null,null,null,null,null,null,null,null,null,null,null,null,null,null,null,null,null,null,null,null,null,null,null,null,null,null,null,null,null,null,null,null,null,null,null,null,null,null,null,null,null,{"$f":"IF($B$12>EOT,$B$12&\"  Air End   >= \"&EOT&\" End Open  --  OK\",$B$12&\" Air End   <  \"&EOT&\" End Open  --  Not OK\")","v":"2240  Air End   >= 92 End Open  --  OK"}]
[]
[null,null,null,null,null,null,null,null,null,null,null,null,null,null,null,null,null,null,null,null,null,null,null,null,null,null,null,null,null,null,null,null,null,null,null,null,null,null,null,null,null,null,null,null,null,null,null,null,null,null,"Act: "]
[null,null,null,null,null,null,null,null,null,null,null,null,null,null,null,null,null,null,null,null,null,null,null,null,null,null,null,null,null,null,null,null,null,null,null,null,null,null,null,null,null,null,null,"Fail Open",null,null,null,null,null,"Req.","Req : Va"]
[null,null,null,null,null,null,null,null,null,null,null,null,null,null,null,null,null,null,null,null,null,null,null,null,null,null,null,null,null,null,null,null,null,null,null,null,null,null,null,null,null,null,null,"Stroke Cell",null,"Act. Stroke",null,"Act Torq","Compare","Va Torq","Ratio"]
[null,null,null,null,null,null,null,null,null,null,null,null,null,null,null,null,null,null,null,null,null,null,null,null,null,null,null,null,null,null,null,null,null,null,null,null,null,null,null,null,null,null,null,"H12",null,null,"Spr. Start Torque =  ",{"$f":"$H$12","v":3327},">= Start Open",{"$f":"SOT","v":115},{"$f":"AV28/AX28","v":28.930434782608696},null,"Title:",{"$f":"CHOOSE($BQ$10,\"Torque vs. Va. Position -- Fail Closed\", \"Torque vs. Va. Position -- Fail Open\")","v":"Torque vs. Va. Position -- Fail Closed"}]
[null,null,null,null,null,null,null,null,null,null,null,null,null,null,null,null,null,null,null,null,null,null,null,null,null,null,null,null,null,null,null,null,null,null,null,null,null,null,null,null,null,null,null,"I12",null,null,"Spr. End Torque =  ",{"$f":"$I$12","v":2230},">= End Open",{"$f":"EOT","v":92},{"$f":"AV29/AX29","v":24.239130434782609}]
[null,null,null,null,null,null,null,null,null,null,null,null,null,null,null,null,null,null,null,null,null,null,null,null,null,null,null,null,null,null,null,null,null,null,null,null,null,null,null,null,null,null,null,"A12",null,null,"Air Start Torque =  ",{"$f":"$A$12","v":3452},">= Start Closed",{"$f":"SCT","v":104},{"$f":"AV30/AX30","v":33.192307692307693},null,null,"Postion","Req. Va. Closing","Req. Va. Opening",{"$f":"CHOOSE($BQ$10,\"Spr. Closing\", \"Spr. Opening\")","v":"Spr. Closing"},{"$f":"CHOOSE($BQ$10,\"Air Opening\", \"Air Closing\")","v":"Air Opening"}]
[null,null,null,null,null,null,null,null,null,null,null,null,null,null,null,null,null,null,null,null,null,null,null,null,null,null,null,null,null,null,null,null,null,null,null,null,null,null,null,null,null,null,null,"B12",null,null,"Air End Torque = ",{"$f":"$B$12","v":2240},">= End Closed",{"$f":"ECT","v":98},{"$f":"AV31/AX31","v":22.857142857142858},null,"Closed",0,{"$f":"ECT","v":98},{"$f":"SOT","v":115},{"$f":"CHOOSE($BQ$10,$I$12,$H$12)","v":2230},{"$f":"CHOOSE($BQ$10,$A$12,$B$12)","v":3452}]
[null,null,null,null,null,null,null,null,null,null,null,null,null,null,null,null,null,null,null,null,null,null,null,null,null,null,null,null,null,null,null,null,null,null,null,null,null,null,null,null,null,null,null,null,null,null,"Min. FO Act Torque =",{"$f":"MIN(AV28:AV31)","v":2230},"Min. FO Req : Va",null,{"$f":"MIN(AY28:AY31)","v":22.857142857142858},null,null,15,{"$f":"0.7*SOT","v":80.5},{"$f":"0.72*SOT","v":82.8},{"$f":"NA()","v":{"$error":"#N/A"}},{"$f":"NA()","v":{"$error":"#N/A"}}]
[null,null,null,null,null,null,null,null,null,null,null,null,null,null,null,null,null,null,null,null,null,null,null,null,null,null,null,null,null,null,null,null,null,null,null,null,null,null,null,null,null,null,null,"F.O. Information for S.R. Pneumatic Act.",null,null,null,null,null,null,null,null,null,30,{"$f":"0.7*SOT","v":80.5},{"$f":"0.72*SOT","v":82.8},{"$f":"NA()","v":{"$error":"#N/A"}},{"$f":"NA()","v":{"$error":"#N/A"}}]
[null,null,null,null,null,null,null,null,null,null,null,null,null,null,null,null,null,null,null,null,null,null,null,null,null,null,null,null,null,null,null,null,null,null,null,null,null,null,null,null,null,null,null,"Vs. Va. Torque Comparison (Table 7C)",null,null,null,null,null,null,null,null,null,45,{"$f":"0.7*SOT","v":80.5},{"$f":"0.72*SOT","v":82.8},{"$f":"NA()","v":{"$error":"#N/A"}},{"$f":"NA()","v":{"$error":"#N/A"}}]
[null,null,null,null,null,null,null,null,null,null,null,null,null,null,null,null,null,null,null,null,null,null,null,null,null,null,null,null,null,null,null,null,null,null,null,null,null,null,null,null,null,null,null,{"$f":"IF($H$12>SOT,$H$12&\" Spr. Start >= \"&SOT&\" Start Open -- OK\", $H$12&\" Spr. Star < \"&SOT& \" Start Open -- Not OK\")","v":"3327 Spr. Start >= 115 Start Open -- OK"},null,null,null,null,"AD34:AD38",null,null,null,null,60,{"$f":"0.7*SOT","v":80.5},{"$f":"0.72*SOT","v":82.8},{"$f":"NA()","v":{"$error":"#N/A"}},{"$f":"NA()","v":{"$error":"#N/A"}}]
[null,null,null,null,null,null,null,null,null,null,null,null,null,null,null,null,null,null,null,null,null,null,null,null,null,null,null,null,null,null,null,null,null,null,null,null,null,null,null,null,null,null,null,{"$f":"IF($I$12>EOT,$I$12&\" Spr. End  >= \"&EOT&\" End Open  --  OK\", $I$12&\" Spr. End  < \"&EOT&\" End Open  --   Not OK\")","v":"2230 Spr. End  >= 92 End Open  --  OK"},null,null,null,null,null,null,null,null,null,75,{"$f":"0.7*SOT","v":80.5},{"$f":"0.72*SOT","v":82.8},{"$f":"NA()","v":{"$error":"#N/A"}},{"$f":"NA()","v":{"$error":"#N/A"}}]
[null,null,null,null,null,null,null,null,null,null,null,null,null,null,null,null,null,null,null,null,null,null,null,null,null,null,null,null,null,null,null,null,null,null,null,null,null,null,null,null,null,null,null,{"$f":"IF($A$12>SCT,$A$12&\" Air Start  >=  \"&SCT&\" Start Closed  --  OK\",$A$12& \" Air Start  <  \"&SCT&\" Start Closed  --  Not OK\")","v":"3452 Air Start  >=  104 Start Closed  --  OK"},null,null,null,null,null,null,null,null,"Open",90,{"$f":"SCT","v":104},{"$f":"EOT","v":92},{"$f":"CHOOSE($BQ$10,$H$12, $I$12)","v":3327},{"$f":"CHOOSE($BQ$10,$B$12,$A$12)","v":2240}]
[null,null,null,null,null,null,null,null,null,null,null,null,null,null,null,null,null,null,null,null,null,null,null,null,null,null,null,null,null,null,null,null,null,null,null,null,null,null,null,null,null,null,null,{"$f":"IF($B$12>ECT,$B$12&\" Air End   >=  \"&ECT&\" End Closed -- OK\",$B$12&\" Air End   <  \"&ECT& \" End Closed -- Not OK\")","v":"2240 Air End   >=  98 End Closed -- OK"}]
[]
[]
[]
[null,null,null,null,"Sort Order 2",null,null,null,null,null,null,null,null,null,null,null,null,null,null,null,null,null,null,null,null,null,null,null,null,"FC Sort Order 3",null,null,null,null,"FC Sort Ord. 3","FC Sort Ord. 1","FO Sort Ord. 1"]
[null,null,null,null,null,null,null,null,null,null,null,null,null,null,null,null,null,null,null,null,null,null,null,null,null,null,null,null,null,null,null,null,null,null,null,"All FC > Req","All FO > Req",null,null,null,null,null,null,"Valve Start (Break) Open Torque  -->  Start Open from Closed Position"]
[null,null,null,null,null,null,null,null,null,null,null,null,null,null,null,null,null,null,null,null,null,null,null,null,null,null,null,null,null,null,null,null,null,null,null,"Spr. Start >=","Spr. Start >=",null,null,null,null,null,null,"Valve End Open Torque --> End Open from Closed Position",null,null,null,null,null,null,null,"Fail Safe Spring Return Pneumatic Actuator"]
[null,null,null,null,null,null,null,null,null,null,null,null,null,null,null,null,null,null,null,null,null,null,null,null,null,null,null,null,null,null,null,null,null,null,null,"Start Closed","Start Open",null,null,null,null,null,null,"Valve Start Closed Torque --> Start Closed from Open Position",null,null,null,null,null,null,null,{"$f":"BB64","v":"Torque vs. Va. Position -- Fail Closed"}]
[null,null,null,null,null,null,null,null,null,null,null,null,null,null,null,null,null,null,null,null,null,null,null,null,null,null,null,null,null,null,null,null,null,null,null,"Spr. End >=","Spr. End >=",null,null,null,null,null,null,"Valve End Closed Torque --> End Closed from Open Position"]
[null,null,null,null,null,null,null,null,null,"FS_Pneu_Act_New",null,null,null,null,null,null,null,null,null,null,null,null,null,null,null,null,null,null,null,null,null,null,null,null,null,"End Closed","End Open"]
["New Spring Return Pneumatic Act. Data Table (Table 7B)",null,null,null,null,null,null,null,null,"A52:AO126",null,null,"New SR Pneumatic Act.",null,null,null,null,null,null,null,null,null,null,null,null,null,"New SR Pneumatic Act.",null,null,null,null,null,null,null,null,"Air Start >=","Air Start >="]
[{"$f":"CONCATENATE(\"Air Torq. @ \",$BM$16)","v":"Air Torq. @ 80 PSI"},null,"\"New\" Spring Return Pneumatic Act. Torque (lbf-in.) - Sorted by True / False, Act. Size, Min. Torque Ratio",null,null,null,null,null,null,null,null,null,null,null,null,null,null,null,null,null,null,null,null,null,null,"Fail Close Act. : Va. Required Torque Ratio",null,null,null,null,"Fail Open Act. : Va. Required Torque Ratio",null,null,null,null,"Start Open","Start Closed"]
["Start","End","Model No.","Valbia ID","UT size","Spring","Spr. Set","Spring Torque",null,"40 PSI",null,"50 PSI",null,"60 PSI",null,"70 PSI",null,"80 PSI",null,"90 PSI",null,"100 PSI",null,"115 PSI",null,"Spr. Start","Spr. End","Air Start","Air End","Min","Spr. Start","Spr. End","Air Start","Air End","Min","Air End >=","Air End >=","Mount","Stem","Cycle Time, s",null,"Lookup",null,null,null,null,null,null,null,null,"Act: "]
[{"$f":"CONCATENATE($BM$17,\"_Start\")","v":"80_Start"},{"$f":"CONCATENATE($BM$17,\"_End\")","v":"80_End"},null,null,null,"Set Press","No.","Start","End","40_Start","40_End","50_Start","50_End","60_Start","60_End","70_Start","70_End","80_Start","80_End","90_Start","90_End","100_Start","100_End","115_Start","115_End","SCT","ECT","SOT","EOT",null,"SOT","EOT","SCT","ECT",null,"End Open","End Closed",null,"Sq.","CCW","CW","Row No.",null,"Fail Close",null,null,null,null,null,"Req.","Req : Va"]
[{"$f":"HLOOKUP($A$51,$C$51:$Y$126,AP52,FALSE)","v":193},{"$f":"HLOOKUP($B$51,$C$51:$Y$126,AP52,FALSE)","v":95},"UT-1-SR-05","SR 63",1,"79.8-87",5,196,111,"-","-","-","-","-","-",151,53,193,95,235,136,276,178,339,241,{"$f":"H52/SCT","v":1.8846153846153846},{"$f":"I52/ECT","v":1.1326530612244898},{"$f":"A52/SOT","v":1.6782608695652175},{"$f":"B52/EOT","v":1.0326086956521738},{"$f":"MIN(Z52:AC52)","v":1.0326086956521738},{"$f":"H52/SOT","v":1.7043478260869565},{"$f":"I52/EOT","v":1.2065217391304348},{"$f":"A52/SCT","v":1.8557692307692308},{"$f":"B52/ECT","v":0.96938775510204078},{"$f":"MIN(AE52:AH52)","v":0.96938775510204078},{"$f":"AND(H52>=SCT,I52>=ECT,A52>=SOT,B52>=EOT,A52<>\"-\",B52<>\"-\")","v":true},{"$f":"AND(H52>=SOT,I52>=EOT,A52>=SCT,B52>=ECT,A52<>\"-\",B52<>\"-\")","v":false},"F05/F07",14,0.13,0.13,2,null,"Stroke Cell",null,"Act. Stroke",null,"Act Torq","Compare","Va Torq","Ratio"]
[354,157,"UT-2-SR-05","SR 75",2,"79.8-87",5,380,205,"-","-","-","-","-","-",279,81,354,157,430,232,505,303,618,421,3.6538461538461537,2.0918367346938775,3.0782608695652174,1.7065217391304348,1.7065217391304348,3.3043478260869565,2.2282608695652173,3.4038461538461537,1.6020408163265305,1.6020408163265305,true,true,"F05/F07",17,0.32,0.3,3,null,"H80",null,null,"Spr. Start Torque =  ",{"$f":"$H$52","v":196},">= Start Closed",{"$f":"SCT","v":104},{"$f":"AV53/AX53","v":1.8846153846153846}]
[398,234,"UT-2-SR-04","SR 75",2,"72.5-79.8",4,303,162,"-","-","-","-",247,83,322,158,398,234,473,309,549,385,"-","-",2.9134615384615383,1.653061224489796,3.4608695652173913,2.5434782608695654,1.653061224489796,2.6347826086956521,1.7608695652173914,3.8269230769230771,2.3877551020408165,1.7608695652173914,true,true,"F05/F07",17,0.32,0.3,4,null,"I80",null,null,"Spr. End Torque =  ",{"$f":"$I$52","v":111},">= End Closed",{"$f":"ECT","v":98},{"$f":"AV54/AX54","v":1.1326530612244898}]
[426,288,"UT-2-SR-03","SR 75",2,"58-72.5",3,249,133,"-","-","-","-",275,137,351,212,426,288,502,363,"-","-","-","-",2.3942307692307692,1.3571428571428572,3.7043478260869565,3.1304347826086958,1.3571428571428572,2.1652173913043478,1.4456521739130435,4.0961538461538458,2.9387755102040818,1.4456521739130435,true,true,"F05/F07",17,0.32,0.3,5,null,"A80",null,null,"Air Start Torque =  ",{"$f":"$A$52","v":193},">= Start Open",{"$f":"SOT","v":115},{"$f":"AV55/AX55","v":1.6782608695652175}]
[503,257,"UT-2.5-SR-05","SR 85",2.5,"79.8-87",5,536,321,"-","-","-","-","-","-",392,146,503,257,614,368,725,478,891,645,5.1538461538461542,3.2755102040816326,4.3739130434782609,2.7934782608695654,2.7934782608695654,4.660869565217391,3.4891304347826089,4.8365384615384617,2.6224489795918369,2.6224489795918369,true,true,"F05/F07",17,0.32,0.3,6,null,"B80",null,null,"Air End Torque = ",{"$f":"$B$52","v":95},">= End Open",{"$f":"EOT","v":92},{"$f":"AV56/AX56","v":1.0326086956521738}]
[576,376,"UT-2.5-SR-04","SR 85",2.5,"72.5-79.8",4,417,248,"-","-","-","-",354,155,465,265,576,376,687,487,797,633,"-","-",4.009615384615385,2.5306122448979593,5.0086956521739134,4.0869565217391308,2.5306122448979593,3.6260869565217391,2.6956521739130435,5.5384615384615383,3.8367346938775508,2.6956521739130435,true,true,"F05/F07",17,0.32,0.3,7,null,null,null,null,"Min. FC Act Torque =",{"$f":"MIN(AV53:AV56)","v":95},"Min. FC Req : Va",null,{"$f":"MIN(AY53:AY56)","v":1.0326086956521738}]
[609,432,"UT-2.5-SR-03","SR 85",2.5,"58-72.5",3,361,215,"-","-","-","-",387,211,498,322,609,432,720,543,"-","-","-","-",3.4711538461538463,2.193877551020408,5.2956521739130435,4.6956521739130439,2.193877551020408,3.1391304347826088,2.3369565217391304,5.8557692307692308,4.408163265306122,2.3369565217391304,true,true,"F05/F07",17,0.32,0.3,8,null,"F.C. Information for S.R. Pneumatic Act."]
[802,378,"UT-3-SR-05","SR 100",3,"79.8-87",5,860,489,"-","-","-","-","-","-",630,206,802,378,975,551,1147,723,1443,1027,8.2692307692307701,4.9897959183673466,6.9739130434782606,4.1086956521739131,4.1086956521739131,7.4782608695652177,5.3152173913043477,7.7115384615384617,3.8571428571428572,3.8571428571428572,true,true,"F07/F10",17,0.54,0.48,9,null,"Vs. Va. Torque Comparison (Table 7B)"]
[903,548,"UT-3-SR-04","SR 100",3,"72.5-79.8",4,691,389,"-","-","-","-",558,203,730,375,903,548,1075,720,1248,893,"-","-",6.6442307692307692,3.9693877551020407,7.8521739130434787,5.9565217391304346,3.9693877551020407,6.0086956521739134,4.2282608695652177,8.6826923076923084,5.591836734693878,4.2282608695652177,true,true,"F07/F10",17,0.54,0.48,10,null,{"$f":"IF($I$52>SCT,$I$52&\" Spr. Start >= \"&SCT&\" Start Closed  --  OK\", $I$52&\" Spr. Start < \"&SCT&\" Start Closed --  Not OK\")","v":"111 Spr. Start >= 104 Start Closed  --  OK"},null,null,null,null,"AD88:AD91"]
[973,674,"UT-3-SR-03","SR 100",3,"58 -72.5",3,564,318,"-","-","-","-",628,329,801,502,973,674,1146,847,"-","-","-","-",5.4230769230769234,3.2448979591836733,8.4608695652173918,7.3260869565217392,3.2448979591836733,4.9043478260869566,3.4565217391304346,9.3557692307692299,6.8775510204081636,3.4565217391304346,true,true,"F07/F10",17,0.54,0.48,11,null,{"$f":"IF($H$52>ECT,$H$52&\" Spr. End  >= \"&ECT&\" End Closed -- OK\", $H$52&\" Spr. End  < \"&ECT&\" End Closed -- Not OK\")","v":"196 Spr. End  >= 98 End Closed -- OK"}]
[1352,637,"UT-3.5-SR-05","SR 115",3.5,"79.8-87",5,1432,800,"-","-","-","-","-","-",1067,352,1352,637,1638,922,1923,1207,2350,1635,13.76923076923077,8.1632653061224492,11.756521739130434,6.9239130434782608,6.9239130434782608,12.452173913043477,8.695652173913043,13,6.5,6.5,true,true,"F07/F10",22,0.92,0.75,12,null,{"$f":"IF($A$52>SOT,$A$52&\" Air Start  >=  \"&SOT&\" Start Open -- OK\",$A$52&\" Air Start  <  \"&SOT&\" Start Open -- Not OK\")","v":"193 Air Start  >=  115 Start Open -- OK"}]
[1528,935,"UT-3.5-SR-04","SR 115",3.5,"72.5-79.8",4,1133,625,"-","-","-","-",958,365,1243,650,1528,935,1813,1220,2098,1505,"-","-",10.89423076923077,6.3775510204081636,13.28695652173913,10.163043478260869,6.3775510204081636,9.8521739130434778,6.7934782608695654,14.692307692307692,9.5408163265306118,6.7934782608695654,true,true,"F07/F10",22,0.92,0.75,13,null,{"$f":"IF($B$52>EOT,$B$52&\"  Air End   >= \"&EOT&\" End Open  --  OK\",$B$52&\" Air End   <  \"&EOT&\" End Open  --  Not OK\")","v":"95  Air End   >= 92 End Open  --  OK"}]
[1615,1112,"UT-3.5-SR-03","SR 115",3.5,"58-72.5",3,957,538,"-","-","-","-",1044,541,1329,827,1615,1112,1900,1397,"-","-","-","-",9.2019230769230766,5.4897959183673466,14.043478260869565,12.086956521739131,5.4897959183673466,8.3217391304347821,5.8478260869565215,15.528846153846153,11.346938775510203,5.8478260869565215,true,true,"F07/F10",22,0.92,0.75,14,null,null,null,null,null,null,null,null,null,null,"Title:",{"$f":"CHOOSE($BQ$10,\"Torque vs. Va. Position -- Fail Closed\", \"Torque vs. Va. Position -- Fail Open\")","v":"Torque vs. Va. Position -- Fail Closed"}]
[1762,789,"UT-4-SR-05","SR 125",4,"79.8-87",5,1913,1055,"-","-","-","-","-","-",1388,415,1762,789,2136,1164,2511,1538,3072,2099,18.39423076923077,10.76530612244898,15.321739130434782,8.5760869565217384,8.5760869565217384,16.634782608695652,11.467391304347826,16.942307692307693,8.0510204081632661,8.0510204081632661,true,true,"F07/F10",22,1.2,0.94,15]
[2010,1226,"UT-4-SR-04","SR 125",4,"72.5-79.8",4,1477,808,"-","-","-","-",1261,477,1636,851,2010,1226,2389,1600,2758,1974,"-","-",14.201923076923077,8.2448979591836729,17.478260869565219,13.326086956521738,8.2448979591836729,12.843478260869565,8.7826086956521738,19.326923076923077,12.510204081632653,8.7826086956521738,true,true,"F07/F10",22,1.2,0.94,16,null,null,null,null,null,null,null,null,"Act: ",null,null,"Postion","Req. Va. Closing","Req. Va. Opening",{"$f":"CHOOSE($BQ$10,\"Spr. Closing\", \"Spr. Opening\")","v":"Spr. Closing"},{"$f":"CHOOSE($BQ$10,\"Air Opening\", \"Air Closing\")","v":"Air Opening"}]
[2099,1389,"UT-4-SR-03","SR 125",4,"58-72.5",3,1313,718,"-","-","-","-",1351,640,1725,1015,2099,1389,2474,1763,"-","-","-","-",12.625,7.3265306122448983,18.252173913043478,15.097826086956522,7.3265306122448983,11.417391304347825,7.8043478260869561,20.182692307692307,14.173469387755102,7.8043478260869561,true,true,"F07/F10",22,1.2,0.94,17,null,"Fail Open",null,null,null,null,null,"Req.","Req : Va",null,"Closed",0,{"$f":"ECT","v":98},{"$f":"SOT","v":115},{"$f":"CHOOSE($BQ$10,$I$52,$H$52)","v":111},{"$f":"CHOOSE($BQ$10,$A$52,$B$52)","v":193}]
[2813,1671,"UT-4.5-SR-04","SR 140",4.5,"58-101.5","4",2124,1133,"-","-","-","-",1807,665,2310,1168,2813,1671,3316,2174,3819,2677,"-","-",20.423076923076923,11.561224489795919,24.46086956521739,18.163043478260871,11.561224489795919,18.469565217391306,12.315217391304348,27.048076923076923,17.051020408163264,12.315217391304348,true,true,"F10/F12",27,1.64,1.25,18,null,"Stroke Cell",null,"Act. Stroke",null,"Act Torq","Compare","Va Torq","Ratio",null,null,15,{"$f":"0.7*SOT","v":80.5},{"$f":"0.72*SOT","v":82.8},{"$f":"NA()","v":{"$error":"#N/A"}},{"$f":"NA()","v":{"$error":"#N/A"}}]
[2482,1018,"UT-4.5-SR-05","SR 140",4.5,"72.5-116","5",2726,1452,"-","-","-","-","-","-",1981,516,2482,1018,2982,1520,3483,2022,4239,2775,26.21153846153846,14.816326530612244,21.582608695652173,11.065217391304348,11.065217391304348,23.704347826086956,15.782608695652174,23.865384615384617,10.387755102040817,10.387755102040817,true,true,"F10/F12",27,1.64,1.25,19,null,"H80",null,null,"Spr. Start Torque =  ",{"$f":"$H$52","v":196},">= Start Open",{"$f":"SOT","v":115},{"$f":"AV69/AX69","v":1.7043478260869565},null,null,30,{"$f":"0.7*SOT","v":80.5},{"$f":"0.72*SOT","v":82.8},{"$f":"NA()","v":{"$error":"#N/A"}},{"$f":"NA()","v":{"$error":"#N/A"}}]
[2916,1862,"UT-4.5-SR-03","SR 140",4.5,"58-87","3",1956,1036,"-","-","-","-",1915,861,2415,1362,2916,1862,3416,2363,"-","-","-","-",18.807692307692307,10.571428571428571,25.356521739130436,20.239130434782609,10.571428571428571,17.008695652173913,11.260869565217391,28.03846153846154,19,11.260869565217391,true,true,"F10/F12",27,1.64,1.25,20,null,"I80",null,null,"Spr. End Torque =  ",{"$f":"$I$52","v":111},">= End Open",{"$f":"EOT","v":92},{"$f":"AV70/AX70","v":1.2065217391304348},null,null,45,{"$f":"0.7*SOT","v":80.5},{"$f":"0.72*SOT","v":82.8},{"$f":"NA()","v":{"$error":"#N/A"}},{"$f":"NA()","v":{"$error":"#N/A"}}]
[3452,2240,"UT-5-SR-05","SR 160",5,"72.6-87",5,3327,2230,"-","-","-","-","-","-",2737,1507,3452,2240,4175,2963,"-","-","-","-",31.990384615384617,22.755102040816325,30.017391304347825,24.347826086956523,22.755102040816325,28.930434782608696,24.239130434782609,33.192307692307693,22.857142857142858,22.857142857142858,true,true,"F10/F12",27,2.27,1.6,21,null,"A80",null,null,"Air Start Torque =  ",{"$f":"$A$52","v":193},">= Start Closed",{"$f":"SCT","v":104},{"$f":"AV71/AX71","v":1.8557692307692308},null,null,60,{"$f":"0.7*SOT","v":80.5},{"$f":"0.72*SOT","v":82.8},{"$f":"NA()","v":{"$error":"#N/A"}},{"$f":"NA()","v":{"$error":"#N/A"}}]
[3886,2779,"UT-5-SR-04","SR 160",5,"58-79.8",4,2841,1770,"-","-","-","-",2447,1350,3162,2074,3886,2779,"-","-","-","-","-","-",27.317307692307693,18.061224489795919,33.791304347826085,30.206521739130434,18.061224489795919,24.704347826086956,19.239130434782609,37.365384615384613,28.357142857142858,19.239130434782609,true,true,"F10/F12",27,2.27,1.6,22,null,"B80",null,null,"Air End Torque = ",{"$f":"$B$52","v":95},">= End Closed",{"$f":"ECT","v":98},{"$f":"AV72/AX72","v":0.96938775510204078},null,null,75,{"$f":"0.7*SOT","v":80.5},{"$f":"0.72*SOT","v":82.8},{"$f":"NA()","v":{"$error":"#N/A"}},{"$f":"NA()","v":{"$error":"#N/A"}}]
[2983,1443,"UT-5-SR-06","SR 160",5,"87-101.6",6,4186,2655,"-","-","-","-","-","-","-","-",2983,1443,3715,2167,4421,2828,5475,3865,40.25,27.091836734693878,25.939130434782609,15.684782608695652,15.684782608695652,36.4,28.858695652173914,28.682692307692307,14.724489795918368,14.724489795918368,true,true,"F10/F12",27,2.27,1.6,23,null,null,null,null,"Min. FO Act Torque =",{"$f":"MIN(AV69:AV72)","v":95},"Min. FO Req : Va",null,{"$f":"MIN(AY69:AY72)","v":0.96938775510204078},null,"Open",90,{"$f":"SCT","v":104},{"$f":"EOT","v":92},{"$f":"CHOOSE($BQ$10,$H$52, $I$52)","v":196},{"$f":"CHOOSE($BQ$10,$B$52,$A$52)","v":95}]
[5893,3539,"UT-6-SR-06","SR 200",6,"87-101.6",6,6867,4664,"-","-","-","-","-","-","-","-",5893,3539,7288,4925,8591,6175,10562,8137,66.02884615384616,47.591836734693878,51.243478260869566,38.467391304347828,38.467391304347828,59.713043478260872,50.695652173913047,56.66346153846154,36.112244897959187,36.112244897959187,true,true,"F14",36,3.58,2.8,24,null,"F.O. Information for S.R. Pneumatic Act."]
[6822,5008,"UT-6-SR-05","SR 200",6,"72.6-87",5,5327,3726,"-","-","-","-","-","-",5453,3613,6822,5008,8182,6385,"-","-","-","-",51.221153846153847,38.020408163265309,59.321739130434786,54.434782608695649,38.020408163265309,46.321739130434786,40.5,65.59615384615384,51.102040816326529,40.5,true,true,"F14",36,3.58,2.8,25,null,"Vs. Va. Torque Comparison (Table 7C)"]
[7486,5795,"UT-6-SR-04","SR 200",6,"58-79.8",4,4699,3124,"-","-","-","-",4788,3080,6126,4445,7486,5795,"-","-","-","-","-","-",45.182692307692307,31.877551020408163,65.095652173913038,62.989130434782609,31.877551020408163,40.860869565217392,33.956521739130437,71.980769230769226,59.132653061224488,33.956521739130437,true,true,"F14",36,3.58,2.8,26,null,{"$f":"IF($I$52>SOT,$I$52&\" Spr. Start >= \"&SOT&\" Start Open -- OK\", $I$52&\" Spr. Star < \"&SOT& \" Start Open -- Not OK\")","v":"111 Spr. Star < 115 Start Open -- Not OK"},null,null,null,null,"AD104:AD107"]
[10594.652948275861,5903.7554482758615,"UT-6.5-SR-05","SR 230",6.5,"58-79.8",5,6195.5249999999996,10612.04925,"-","-","-","-",6068.8677155172409,1606.8689224137931,8400.5825431034482,3755.4647844827582,10594.652948275861,5903.7554482758615,12733.177267241379,8042.279767241379,"-","-","-","-",59.572355769230768,108.2862168367347,92.127416941529233,64.171254872563708,59.572355769230768,53.874130434782607,115.34836141304348,101.87166296419097,60.24240253342716,53.874130434782607,true,true,"F16",46,6.2,5.4,27,null,{"$f":"IF($H$52>EOT,$H$52&\" Spr. End  >= \"&EOT&\" End Open  --  OK\", $H$52&\" Spr. End  < \"&EOT&\" End Open  --   Not OK\")","v":"196 Spr. End  >= 92 End Open  --  OK"}]
[11329.570396551724,7152.016396551724,"UT-6.5-SR-04","SR 230",6.5,"58-87",4,5505.1664999999994,9434.8994999999995,"-","-","-","-",7032.3786724137926,2854.824672413793,9180.9745344827588,5003.4205344827587,11329.570396551724,7152.016396551724,"-","-","-","-","-","-",52.934293269230764,96.27448469387754,98.518003448275863,77.739308658170913,52.934293269230764,47.871013043478257,102.5532554347826,108.93817688992043,72.979759148486977,47.871013043478257,true,true,"F16",46,6.2,5.4,28,null,{"$f":"IF($A$52>SCT,$A$52&\" Air Start  >=  \"&SCT&\" Start Closed  --  OK\",$A$52& \" Air Start  <  \"&SCT&\" Start Closed  --  Not OK\")","v":"193 Air Start  >=  104 Start Closed  --  OK"}]
[9868.891448275861,4646.9489482758618,"UT-6.5-SR-06","SR 230",6.5,"72.5-116",6,6877.0327499999994,11789.198999999999,"-","-","-","-",null,null,7721.6795025267529,2499.7370025267537,9868.891448275861,4646.9489482758618,12008.941758620689,6786.9992586206899,14157.537620689654,8935.5951206896552,17372.191060344827,12150.248560344828,66.125314903846146,120.29794897959182,85.816447376311828,50.510314655172408,50.510314655172408,59.800284782608692,128.14346739130434,94.89318700265251,47.417846410978179,47.417846410978179,true,true,"F16",46,6.2,5.4,29,null,{"$f":"IF($B$52>ECT,$B$52&\" Air End   >=  \"&ECT&\" End Closed -- OK\",$B$52&\" Air End   <  \"&ECT& \" End Closed -- Not OK\")","v":"95 Air End   <  98 End Closed -- Not OK"}]
[16319,10681,"UT-7-SR-07","SR 270",7,"58-101.5",7,15336,9832,"-","-","-","-",9584,3955,13009,7381,16319,10681,19619,13990,23053,17416,"-","-",147.46153846153845,100.32653061224489,141.90434782608696,116.09782608695652,100.32653061224489,133.35652173913044,106.8695652173913,156.91346153846155,108.98979591836735,106.8695652173913,true,true,"F16",46,9,6.6,30]
[15363,9221,"UT-7-SR-08","SR 270",7,"58-116",8,16735,10735,"-","-","-","-",8637,2486,12063,5912,15363,9221,18672,12521,22098,15947,27115,20965,160.91346153846155,109.54081632653062,133.59130434782608,100.22826086956522,100.22826086956522,145.52173913043478,116.68478260869566,147.72115384615384,94.091836734693871,94.091836734693871,true,true,"F16",46,9,6.6,31]
[17274,12150,"UT-7-SR-06","SR 270",7,"58-79.8",6,13947,8938,"-","-","-","-",10539,5415,13965,8850,17274,12150,20574,15459,"-","-","-","-",134.10576923076923,91.204081632653057,150.2086956521739,132.06521739130434,91.204081632653057,121.27826086956522,97.152173913043484,166.09615384615384,123.9795918367347,97.152173913043484,true,true,"F16",46,9,6.6,32]
[18221,13619,"UT-7-SR-05","SR 270",7,"58-79.8",5,12549,8044,"-","-",8069,3459,11495,6884,14921,10310,18221,13619,21530,16920,"-","-","-","-",120.66346153846153,82.08163265306122,158.44347826086957,148.03260869565219,82.08163265306122,109.12173913043478,87.434782608695656,175.20192307692307,138.96938775510205,87.434782608695656,true,true,"F16",46,9,6.6,33]
[19177,15080,"UT-7-SR-04","SR 270",7,"43.5-79.8",4,11159,7150,5716,1619,9016,4928,12442,8353,15877,11779,19177,15080,"-","-","-","-","-","-",{"$f":"H84/SCT","v":107.29807692307692},{"$f":"I84/ECT","v":72.959183673469383},{"$f":"A84/SOT","v":166.75652173913045},{"$f":"B84/EOT","v":163.91304347826087},{"$f":"MIN(Z84:AC84)","v":72.959183673469383},{"$f":"H84/SOT","v":97.03478260869565},{"$f":"I84/EOT","v":77.717391304347828},{"$f":"A84/SCT","v":184.39423076923077},{"$f":"B84/ECT","v":153.87755102040816},{"$f":"MIN(AE84:AH84)","v":77.717391304347828},{"$f":"AND(H84>=SCT,I84>=ECT,A84>=SOT,B84>=EOT,A84<>\"-\",B84<>\"-\")","v":true},{"$f":"AND(H84>=SOT,I84>=EOT,A84>=SCT,B84>=ECT,A84<>\"-\",B84<>\"-\")","v":true},"F16",46,9,6.6,34]
[26648.387456896551,16540.830956896549,"UT-7.5-SR-07","SR-330",7.5,"58-101.5",7,17205.858,26720.414249999998,"-","-","-","-",15417.090905172414,5309.5344051724132,21032.739181034482,10925.182681034483,26648.387456896551,16540.830956896549,32262.204543103446,22154.648043103447,37871.748853448269,27764.192353448278,"-","-",165.4409423076923,272.65728826530608,231.72510832083958,179.79164083583206,165.4409423076923,149.61615652173913,290.43928532608692,256.23449477785147,168.78398935608723,149.61615652173913,true,true,"F16/F25",55,8.6999999999999993,9.65,35]
[24984.446456896549,13956.411956896551,"UT-7.5-SR-08","SR 270",7.5,"58-116",8,18772.440749999998,29154.370499999997,"-","-","-","-","-","-",19369.640107312724,8341.605607312722,24984.446456896549,13956.411956896551,30598.263543103447,19570.229043103449,36207.80785344827,25179.773353448276,44630.364672413794,33602.330172413793,180.5042379807692,297.49357653061224,217.25605614692651,151.70012996626684,151.70012996626684,163.2386152173913,316.89533152173908,240.23506208554375,142.41236690710767,142.41236690710767,true,true,"F16/F25",55,8.6999999999999993,9.65,36]
[28303.477706896549,19116.399206896549,"UT-7.5-SR-06","SR-330",7.5,"58-79.8",6,15639.275249999999,24295.30875,"-","-","-","-",17072.181155172413,7885.1026551724135,22687.829431034483,13500.750931034481,28303.477706896549,19116.399206896549,33919.125982758618,24732.047482758622,"-","-","-","-",150.37764663461536,247.91131377551019,246.11719745127434,207.78694790104944,150.37764663461536,135.99369782608696,264.07944293478261,272.14882410477452,195.06529802955663,135.99369782608696,true,true,"F16/F25",55,8.6999999999999993,9.65,37]
[29967.418706896551,21700.818206896551,"UT-7.5-SR-05","SR-330",7.5,"58-79.8",5,14081.543249999999,21861.352500000001,"-","-","-","-",18736.122155172416,10469.521655172413,24351.770431034482,16085.169931034481,29967.418706896551,21700.818206896551,35583.066982758617,27316.46648275862,"-","-","-","-",135.39945432692306,223.07502551020409,260.58624962518741,235.87845877061469,135.39945432692306,122.44820217391303,237.62339673913044,288.14825679708224,221.43692047853622,122.44820217391303,true,true,"F16/F25",55,8.6999999999999993,9.65,38]
[31631.35970689655,24276.386456896551,"UT-7.5-SR-04","SR-330",7.5,"43.5-79.8",4,12514.960499999999,19436.246999999999,"-","-",14784.414879310345,7429.441629310345,20400.063155172415,13045.089905172414,26015.71143103448,18660.738181034481,31631.35970689655,24276.386456896551,"-","-","-","-","-","-",120.33615865384614,198.32905102040814,275.05530179910045,263.8737658358321,120.33615865384614,108.82574347826086,211.26355434782607,304.1476894893899,247.71822915200562,108.82574347826086,true,true,"F16/F25",55,8.6999999999999993,9.65,39]
[99999,99999,"Consult Eng.",null,99999,99999,99999,99999,99999,99999,99999,99999,99999,99999,99999,99999,99999,99999,99999,99999,99999,99999,99999,99999,99999,961.52884615384619,1020.3979591836735,869.5565217391304,1086.945652173913,869.5565217391304,869.5565217391304,1086.945652173913,961.52884615384619,1020.3979591836735,869.5565217391304,true,true,"--","--","--","--",40]
[{"$f":"HLOOKUP($A$51,$C$51:$Y$126,AP91,FALSE)","v":"-"},{"$f":"HLOOKUP($B$51,$C$51:$Y$126,AP91,FALSE)","v":"-"},"UT-0-SR-01","SR 52",0,"36.3-43.5",1,44,32,48,23,72,47,95,70,"-","-","-","-","-","-","-","-","-","-",0.42307692307692307,0.32653061224489793,{"$error":"#VALUE!"},{"$error":"#VALUE!"},{"$error":"#VALUE!"},0.38260869565217392,0.34782608695652173,{"$error":"#VALUE!"},{"$error":"#VALUE!"},{"$error":"#VALUE!"},false,false,"F03/F05",11,7.0000000000000007E-2,7.0000000000000007E-2,41]
["-","-","UT-0-SR-02","SR 52",0,"43.5-58",2,59,42,"-","-",61,31,84,54,108,77,"-","-","-","-","-","-","-","-",0.56730769230769229,0.42857142857142855,{"$error":"#VALUE!"},{"$error":"#VALUE!"},{"$error":"#VALUE!"},0.5130434782608696,0.45652173913043476,{"$error":"#VALUE!"},{"$error":"#VALUE!"},{"$error":"#VALUE!"},false,false,"F03/F05",11,7.0000000000000007E-2,7.0000000000000007E-2,42]
[101,55,"UT-0-SR-05","SR 52",0,"79.8-87",5,105,72,"-","-","-","-","-","-",78,32,101,55,125,78,148,102,183,137,1.0096153846153846,0.73469387755102045,0.87826086956521743,0.59782608695652173,0.59782608695652173,0.91304347826086951,0.78260869565217395,0.97115384615384615,0.56122448979591832,0.56122448979591832,false,false,"F03/F05",11,7.0000000000000007E-2,7.0000000000000007E-2,43]
[116,78,"UT-0-SR-04","SR 52",0,"72.5-79.8",4,82,57,"-","-","-","-",70,31,93,55,116,78,140,101,163,125,"-","-",0.78846153846153844,0.58163265306122447,1.008695652173913,0.84782608695652173,0.58163265306122447,0.71304347826086956,0.61956521739130432,1.1153846153846154,0.79591836734693877,0.61956521739130432,false,false,"F03/F05",11,7.0000000000000007E-2,7.0000000000000007E-2,44]
[127,94,"UT-0-SR-03","SR 52",0,"58-72.5",3,66,46,"-","-","-","-",80,47,104,70,127,94,150,117,"-","-","-","-",0.63461538461538458,0.46938775510204084,1.1043478260869566,1.0217391304347827,0.46938775510204084,0.57391304347826089,0.5,1.2211538461538463,0.95918367346938771,0.5,false,false,"F03/F05",11,7.0000000000000007E-2,7.0000000000000007E-2,45]
["-","-","UT-1-SR-01","SR 63",1,"36.3-43.5",1,85,44,92,38,134,80,176,122,"-","-","-","-","-","-","-","-","-","-",0.81730769230769229,0.44897959183673469,{"$error":"#VALUE!"},{"$error":"#VALUE!"},{"$error":"#VALUE!"},0.73913043478260865,0.47826086956521741,{"$error":"#VALUE!"},{"$error":"#VALUE!"},{"$error":"#VALUE!"},false,false,"F05/F07",14,0.13,0.13,46]
["-","-","UT-1-SR-02","SR 63",1,"43.5-58",2,109,58,"-","-",120,56,162,98,204,140,"-","-","-","-","-","-","-","-",1.0480769230769231,0.59183673469387754,{"$error":"#VALUE!"},{"$error":"#VALUE!"},{"$error":"#VALUE!"},0.94782608695652171,0.63043478260869568,{"$error":"#VALUE!"},{"$error":"#VALUE!"},{"$error":"#VALUE!"},false,false,"F05/F07",14,0.13,0.13,47]
[219,138,"UT-1-SR-04","SR 63",1,"72.5-79.8",4,152,85,"-","-","-","-",136,54,177,96,219,138,261,180,303,222,"-","-",1.4615384615384615,0.86734693877551017,1.9043478260869566,1.5,0.86734693877551017,1.3217391304347825,0.92391304347826086,2.1057692307692308,1.4081632653061225,0.92391304347826086,false,false,"F05/F07",14,0.13,0.13,48]
[233,162,"UT-1-SR-03","SR 63",1,"58-72.5",3,128,71,"-","-","-","-",149,79,191,121,233,162,275,204,"-","-","-","-",1.2307692307692308,0.72448979591836737,2.026086956521739,1.7608695652173914,0.72448979591836737,1.1130434782608696,0.77173913043478259,2.2403846153846154,1.653061224489796,0.77173913043478259,false,false,"F05/F07",14,0.13,0.13,49]
["-","-","UT-2-SR-01","SR 75",2,"36.3-43.5",1,172,89,168,63,244,138,319,214,"-","-","-","-","-","-","-","-","-","-",1.6538461538461537,0.90816326530612246,{"$error":"#VALUE!"},{"$error":"#VALUE!"},{"$error":"#VALUE!"},1.4956521739130435,0.96739130434782605,{"$error":"#VALUE!"},{"$error":"#VALUE!"},{"$error":"#VALUE!"},false,false,"F05/F07",17,0.32,0.3,50]
["-","-","UT-2-SR-02","SR 75",2,"43.5-58",2,226,118,"-","-",215,85,291,160,366,235,"-","-","-","-","-","-","-","-",2.1730769230769229,1.2040816326530612,{"$error":"#VALUE!"},{"$error":"#VALUE!"},{"$error":"#VALUE!"},1.9652173913043478,1.2826086956521738,{"$error":"#VALUE!"},{"$error":"#VALUE!"},{"$error":"#VALUE!"},false,false,"F05/F07",17,0.32,0.3,51]
["-","-","UT-2.5-SR-01","SR 85",2.5,"36.3-43.5",1,242,143,238,109,349,219,460,330,"-","-","-","-","-","-","-","-","-","-",2.3269230769230771,1.4591836734693877,{"$error":"#VALUE!"},{"$error":"#VALUE!"},{"$error":"#VALUE!"},2.1043478260869564,1.5543478260869565,{"$error":"#VALUE!"},{"$error":"#VALUE!"},{"$error":"#VALUE!"},false,false,"F05/F07",17,0.32,0.3,52]
["-","-","UT-2.5-SR-02","SR 85",2.5,"43.5-58",2,298,176,"-","-",316,163,427,274,537,384,"-","-","-","-","-","-","-","-",2.8653846153846154,1.7959183673469388,{"$error":"#VALUE!"},{"$error":"#VALUE!"},{"$error":"#VALUE!"},2.5913043478260871,1.9130434782608696,{"$error":"#VALUE!"},{"$error":"#VALUE!"},{"$error":"#VALUE!"},false,false,"F05/F07",17,0.32,0.3,53]
["-","-","UT-3-SR-01","SR 100",3,"36.3-43.5",1,395,218,384,154,556,326,728,499,"-","-","-","-","-","-","-","-","-","-",3.7980769230769229,2.2244897959183674,{"$error":"#VALUE!"},{"$error":"#VALUE!"},{"$error":"#VALUE!"},3.4347826086956523,2.3695652173913042,{"$error":"#VALUE!"},{"$error":"#VALUE!"},{"$error":"#VALUE!"},false,false,"F07/F10",17,0.54,0.48,54]
["-","-","UT-3-SR-02","SR 100",3,"43.5-58",2,521,288,"-","-",485,199,658,372,830,544,"-","-","-","-","-","-","-","-",5.009615384615385,2.9387755102040818,{"$error":"#VALUE!"},{"$error":"#VALUE!"},{"$error":"#VALUE!"},4.5304347826086957,3.1304347826086958,{"$error":"#VALUE!"},{"$error":"#VALUE!"},{"$error":"#VALUE!"},false,false,"F07/F10",17,0.54,0.48,55]
["-","-","UT-3.5-SR-01","SR 115",3.5,"36.3-43.5",1,658,363,650,270,935,555,1220,840,"-","-","-","-","-","-","-","-","-","-",6.3269230769230766,3.704081632653061,{"$error":"#VALUE!"},{"$error":"#VALUE!"},{"$error":"#VALUE!"},5.7217391304347824,3.9456521739130435,{"$error":"#VALUE!"},{"$error":"#VALUE!"},{"$error":"#VALUE!"},false,false,"F07/F10",22,0.92,0.75,56]
["-","-","UT-3.5-SR-02","SR 115",3.5,"43.5-58",2,835,449,"-","-",848,378,1133,663,1419,949,"-","-","-","-","-","-","-","-",8.0288461538461533,4.5816326530612246,{"$error":"#VALUE!"},{"$error":"#VALUE!"},{"$error":"#VALUE!"},7.2608695652173916,4.8804347826086953,{"$error":"#VALUE!"},{"$error":"#VALUE!"},{"$error":"#VALUE!"},false,false,"F07/F10",22,0.92,0.75,57]
["-","-","UT-4-SR-01","SR 125",4,"36.3-43.5",1,877,470,850,328,1224,703,1599,1077,"-","-","-","-","-","-","-","-","-","-",8.4326923076923084,4.795918367346939,{"$error":"#VALUE!"},{"$error":"#VALUE!"},{"$error":"#VALUE!"},7.6260869565217391,5.1086956521739131,{"$error":"#VALUE!"},{"$error":"#VALUE!"},{"$error":"#VALUE!"},false,false,"F07/F10",22,1.2,0.94,58]
["-","-","UT-4-SR-02","SR 125",4,"43.5-58",2,1040,560,"-","-",1135,539,1509,914,1883,1288,"-","-","-","-","-","-","-","-",10,5.7142857142857144,{"$error":"#VALUE!"},{"$error":"#VALUE!"},{"$error":"#VALUE!"},9.0434782608695645,6.0869565217391308,{"$error":"#VALUE!"},{"$error":"#VALUE!"},{"$error":"#VALUE!"},false,false,"F07/F10",22,1.2,0.94,59]
["-","-","UT-4.5-SR-01","SR 140",4.5,"36.3-58","1",1345,726,1241,506,1742,1007,"-","-","-","-","-","-","-","-","-","-","-","-",12.932692307692308,7.408163265306122,{"$error":"#VALUE!"},{"$error":"#VALUE!"},{"$error":"#VALUE!"},11.695652173913043,7.8913043478260869,{"$error":"#VALUE!"},{"$error":"#VALUE!"},{"$error":"#VALUE!"},false,false,"F10/F12",27,1.64,1.25,60]
["-","-","UT-4.5-SR-02","SR 140",4.5,"43.5-72.5","2",1522,814,"-","-",1644,821,2142,1322,2645,1822,"-","-","-","-","-","-","-","-",14.634615384615385,8.3061224489795915,{"$error":"#VALUE!"},{"$error":"#VALUE!"},{"$error":"#VALUE!"},13.234782608695653,8.8478260869565215,{"$error":"#VALUE!"},{"$error":"#VALUE!"},{"$error":"#VALUE!"},false,false,"F10/F12",27,1.64,1.25,61]
["-","-","UT-5-SR-02","SR 160",5,"43.5-58",2,1991,1301,"-","-",2228,1503,2952,2217,"-","-","-","-","-","-","-","-","-","-",19.14423076923077,13.275510204081632,{"$error":"#VALUE!"},{"$error":"#VALUE!"},{"$error":"#VALUE!"},17.31304347826087,14.141304347826088,{"$error":"#VALUE!"},{"$error":"#VALUE!"},{"$error":"#VALUE!"},false,false,"F10/F12",27,2.27,1.6,62]
["-","-","UT-5-SR-01","SR 160",5,"36.3-43.5",1,1345,885,1921,1390,2644,2140,"-","-","-","-","-","-","-","-","-","-","-","-",12.932692307692308,9.0306122448979593,{"$error":"#VALUE!"},{"$error":"#VALUE!"},{"$error":"#VALUE!"},11.695652173913043,9.6195652173913047,{"$error":"#VALUE!"},{"$error":"#VALUE!"},{"$error":"#VALUE!"},false,false,"F10/F12",27,2.27,1.6,63]
["-","-","UT-5-SR-03","SR 160",5,"43.5-72.6",3,2336,1531,"-","-",1980,1131,2713,1854,3419,2569,"-","-","-","-","-","-","-","-",22.46153846153846,15.622448979591837,{"$error":"#VALUE!"},{"$error":"#VALUE!"},{"$error":"#VALUE!"},20.31304347826087,16.641304347826086,{"$error":"#VALUE!"},{"$error":"#VALUE!"},{"$error":"#VALUE!"},false,false,"F10/F12",27,2.27,1.6,64]
["-","-","UT-6-SR-02","SR 200",6,"43.5-58",2,3150,2186,"-","-",4414,3308,5770,4681,"-","-","-","-","-","-","-","-","-","-",30.28846153846154,22.306122448979593,{"$error":"#VALUE!"},{"$error":"#VALUE!"},{"$error":"#VALUE!"},27.391304347826086,23.760869565217391,{"$error":"#VALUE!"},{"$error":"#VALUE!"},{"$error":"#VALUE!"},false,false,"F14",36,3.58,2.8,65]
["-","-","UT-6-SR-01","SR 200",6,"36.3-43.5",1,2168,1540,3718,2904,5069,4317,"-","-","-","-","-","-","-","-","-","-","-","-",{"$f":"H116/SCT","v":20.846153846153847},{"$f":"I116/ECT","v":15.714285714285714},{"$f":"A116/SOT","v":{"$error":"#VALUE!"}},{"$f":"B116/EOT","v":{"$error":"#VALUE!"}},{"$f":"MIN(Z116:AC116)","v":{"$error":"#VALUE!"}},{"$f":"H116/SOT","v":18.85217391304348},{"$f":"I116/EOT","v":16.739130434782609},{"$f":"A116/SCT","v":{"$error":"#VALUE!"}},{"$f":"B116/ECT","v":{"$error":"#VALUE!"}},{"$f":"MIN(AE116:AH116)","v":{"$error":"#VALUE!"}},{"$f":"AND(H116>=SCT,I116>=ECT,A116>=SOT,B116>=EOT,A116<>\"-\",B116<>\"-\")","v":false},{"$f":"AND(H116>=SOT,I116>=EOT,A116>=SCT,B116>=ECT,A116<>\"-\",B116<>\"-\")","v":false},"F14",36,3.58,2.8,66]
["-","-","UT-6-SR-03","SR 200",6,"43.5-72.6",3,3752,2637,"-","-",3936,2591,5304,4035,6639,5400,"-","-","-","-","-","-","-","-",36.07692307692308,26.908163265306122,{"$error":"#VALUE!"},{"$error":"#VALUE!"},{"$error":"#VALUE!"},32.626086956521739,28.663043478260871,{"$error":"#VALUE!"},{"$error":"#VALUE!"},{"$error":"#VALUE!"},false,false,"F14",36,3.58,2.8,67]
["-","-","UT-6.5-SR-01","SR 230",6.5,"36.3-58",1,3442.94175,5894.5994999999994,4930.1729482758619,2328.0524482758619,7074.8012327586202,4472.6807327586203,9217.2931293103447,6615.1726293103447,"-","-","-","-","-","-","-","-","-","-",33.105209134615386,60.148974489795911,{"$error":"#VALUE!"},{"$error":"#VALUE!"},{"$error":"#VALUE!"},29.938623913043479,64.071733695652171,{"$error":"#VALUE!"},{"$error":"#VALUE!"},{"$error":"#VALUE!"},false,false,"F16",46,6.2,5.4,68]
["-","-","UT-6.5-SR-02","SR 230",6.5,"43.5-58",2,4124.4494999999997,7071.7492499999998,4206.547836206897,1073.382336206897,6349.0397327586206,3215.8742327586206,8491.5316293103442,5358.3661293103441,"-","-","-","-","-","-","-","-","-","-",39.658168269230764,72.16070663265306,{"$error":"#VALUE!"},{"$error":"#VALUE!"},{"$error":"#VALUE!"},35.864778260869564,76.866839673913049,{"$error":"#VALUE!"},{"$error":"#VALUE!"},{"$error":"#VALUE!"},false,false,"F16",46,6.2,5.4,69]
["-","-","UT-6.5-SR-03","SR 230",6.5,"58-72.5",3,4814.808,8257.749749999999,"-","-","-","-",7758.1401724137922,4111.6311724137931,9906.7360344827575,6260.2270344827593,"-","-","-","-","-","-","-","-",46.296230769230768,84.262752551020398,{"$error":"#VALUE!"},{"$error":"#VALUE!"},{"$error":"#VALUE!"},41.867895652173914,89.758149456521735,{"$error":"#VALUE!"},{"$error":"#VALUE!"},{"$error":"#VALUE!"},false,false,"F16",46,6.2,5.4,70]
["-","-","UT-7-SR-03","SR 270",7,"36.3-72.5",3,9761,6257,6672,3088,9972,6388,13398,9814,16824,13240,"-","-","-","-","-","-","-","-",93.855769230769226,63.846938775510203,{"$error":"#VALUE!"},{"$error":"#VALUE!"},{"$error":"#VALUE!"},84.878260869565224,68.010869565217391,{"$error":"#VALUE!"},{"$error":"#VALUE!"},{"$error":"#VALUE!"},false,false,"F16",46,9,6.6,71]
["-","-","UT-7-SR-02","SR 270",7,"36.3-58",2,8372,5363,7619,4548,10928,7857,14353,11283,"-","-","-","-","-","-","-","-","-","-",80.5,54.724489795918366,{"$error":"#VALUE!"},{"$error":"#VALUE!"},{"$error":"#VALUE!"},72.8,58.293478260869563,{"$error":"#VALUE!"},{"$error":"#VALUE!"},{"$error":"#VALUE!"},false,false,"F16",46,9,6.6,72]
["-","-","UT-7-SR-01","SR 270",7,"36.3-58",1,6973,4469,8574,6017,11883,9317,15309,12743,"-","-","-","-","-","-","-","-","-","-",67.04807692307692,45.602040816326529,{"$error":"#VALUE!"},{"$error":"#VALUE!"},{"$error":"#VALUE!"},60.634782608695652,48.576086956521742,{"$error":"#VALUE!"},{"$error":"#VALUE!"},{"$error":"#VALUE!"},false,false,"F16",46,9,6.6,73]
["-","-","UT-7.5-SR-01","SR-330",7.5,"36.3-58",1,7824.0630000000001,12143.228999999999,14151.738853448276,9558.1996034482763,19767.387129310344,15173.847879310344,25383.035405172413,20789.496155172412,"-","-","-","-","-","-","-","-","-","-",75.231375,123.9105,{"$error":"#VALUE!"},{"$error":"#VALUE!"},{"$error":"#VALUE!"},68.035330434782608,131.99161956521738,{"$error":"#VALUE!"},{"$error":"#VALUE!"},{"$error":"#VALUE!"},false,false,"F16/F25",55,8.6999999999999993,9.65,74]
["-","-","UT-7.5-SR-02","SR-330",7.5,"36.3-58",2,9381.7950000000001,14577.185249999999,12487.797853448275,6973.7806034482755,18103.446129310345,12589.428879310344,23719.094405172415,18205.07715517241,"-","-","-","-","-","-","-","-","-","-",90.209567307692311,148.74678826530612,{"$error":"#VALUE!"},{"$error":"#VALUE!"},{"$error":"#VALUE!"},81.58082608695652,158.44766576086954,{"$error":"#VALUE!"},{"$error":"#VALUE!"},{"$error":"#VALUE!"},false,false,"F16/F25",55,8.6999999999999993,9.65,75]
["-","-","UT-7.5-SR-03","SR-330",7.5,"58-72.5",3,10948.37775,17002.29075,10823.856853448277,4398.2123534482762,16439.505129310346,10013.860629310344,22055.153405172416,15629.508905172414,27670.801681034482,21245.157181034483,"-","-","-","-","-","-","-","-",105.27286298076923,173.49276275510204,{"$error":"#VALUE!"},{"$error":"#VALUE!"},{"$error":"#VALUE!"},95.203284782608691,184.80750815217391,{"$error":"#VALUE!"},{"$error":"#VALUE!"},{"$error":"#VALUE!"},false,false,"F16/F25",55,8.6999999999999993,9.65,76]
["New Valbia Model SR (Valbia Cat. 028/A p14)"]
["Spring Set Pressures for UT-0 thru UT-4 from  Valbia Instruction Manual 028/A p 3.  Spring Set Pressures for UT-5 thru UT-6 from Valbia Cat. 970 p 7."]
[]
[]
["Spring Return Pneumatic Act. Selection Table (Table 7C)",null,null,null,null,null,null,null,null,null,null,null,null,null,null,null,null,null,null,null,null,null,null,null,null,null,"Actuator Torques for Menu"]
[{"$f":"CONCATENATE(\"Air Torq. @ \",$BM$16)","v":"Air Torq. @ 80 PSI"},null,"Selected Spring Return Pneumatic Act. Torque (lbf-in.)",null,null,null,null,null,null,null,null,null,null,null,null,null,null,null,null,null,null,null,null,null,null,null,"Actuator",null,null,"Required(2)",null,null,"Ratio Act:Req"]
["Start","End","Model No.","Valbia ID","UT size","Spring","Spr. Set","Spring Torque",null,"40 PSI",null,"50 PSI",null,"60 PSI",null,"70 PSI",null,"80 PSI",null,"90 PSI",null,"100 PSI",null,"115 PSI",null,null,"Stroke","Torq",null,"Torq(6)","Stroke(5)"]
[{"$f":"CONCATENATE($BM$17,\"_Start\")","v":"80_Start"},{"$f":"CONCATENATE($BM$17,\"_End\")","v":"80_End"},null,null,null,"Set","No.","Start","End","40_Start","40_End","50_Start","50_End","60_Start","60_End","70_Start","70_End","80_Start","80_End","90_Start","90_End","100_Start","100_End","115_Start","115_End",null,"Spr. Start",{"$f":"CHOOSE(DA!$AB$10,AV13,AV53)","v":196},{"$f":"IF(AB134=\"\",\"\",IF(AB134>=AD134,\"≥\",\"<\"))","v":"≥"},{"$f":"CHOOSE(SR!$BQ$10,SCT,SOT)","v":104},{"$f":"CHOOSE(SR!$BQ$10,\"Start Closed\",\"Start Open\")","v":"Start Closed"},null,{"$f":"IF(AB134=\"\",\"\",AB134/AD134)","v":1.8846153846153846}]
[{"$f":"CHOOSE(DA!$AB$10,A12,A52)","v":193},{"$f":"CHOOSE(DA!$AB$10,B12,B52)","v":95},{"$f":"CHOOSE(DA!$AB$10,C12,C52)","v":"UT-1-SR-05"},{"$f":"CHOOSE(DA!$AB$10,D12,D52)","v":"SR 63"},{"$f":"CHOOSE(DA!$AB$10,E12,E52)","v":1},{"$f":"CHOOSE(DA!$AB$10,F12,F52)","v":"79.8-87"},{"$f":"CHOOSE(DA!$AB$10,G12,G52)","v":5},{"$f":"CHOOSE(DA!$AB$10,H12,H52)","v":196},{"$f":"CHOOSE(DA!$AB$10,I12,I52)","v":111},{"$f":"CHOOSE(DA!$AB$10,J12,J52)","v":"-"},{"$f":"CHOOSE(DA!$AB$10,K12,K52)","v":"-"},{"$f":"CHOOSE(DA!$AB$10,L12,L52)","v":"-"},{"$f":"CHOOSE(DA!$AB$10,M12,M52)","v":"-"},{"$f":"CHOOSE(DA!$AB$10,N12,N52)","v":"-"},{"$f":"CHOOSE(DA!$AB$10,O12,O52)","v":"-"},{"$f":"CHOOSE(DA!$AB$10,P12,P52)","v":151},{"$f":"CHOOSE(DA!$AB$10,Q12,Q52)","v":53},{"$f":"CHOOSE(DA!$AB$10,R12,R52)","v":193},{"$f":"CHOOSE(DA!$AB$10,S12,S52)","v":95},{"$f":"CHOOSE(DA!$AB$10,T12,T52)","v":235},{"$f":"CHOOSE(DA!$AB$10,U12,U52)","v":136},{"$f":"CHOOSE(DA!$AB$10,V12,V52)","v":276},{"$f":"CHOOSE(DA!$AB$10,W12,W52)","v":178},{"$f":"CHOOSE(DA!$AB$10,X12,X52)","v":339},{"$f":"CHOOSE(DA!$AB$10,Y12,Y52)","v":241},null,"Spr. End",{"$f":"CHOOSE(DA!$AB$10,AV14,AV54)","v":111},{"$f":"IF(AB135=\"\",\"\",IF(AB135>=AD135,\"≥\",\"<\"))","v":"≥"},{"$f":"CHOOSE(SR!$BQ$10,ECT,EOT)","v":98},{"$f":"CHOOSE(SR!$BQ$10,\"End Closed\",\"End Open\")","v":"End Closed"},null,{"$f":"IF(AB135=\"\",\"\",AB135/AD135)","v":1.1326530612244898}]
[null,null,null,null,null,null,null,null,null,null,null,null,null,null,null,null,null,null,null,null,null,null,null,null,null,null,"Air Start",{"$f":"CHOOSE(DA!$AB$10,AV15,AV55)","v":193},{"$f":"IF(AB136=\"\",\"\",IF(AB136>=AD136,\"≥\",\"<\"))","v":"≥"},{"$f":"CHOOSE(SR!$BQ$10,SOT,SCT)","v":115},{"$f":"CHOOSE(SR!$BQ$10,\"Start Open\",\"Start Closed\")","v":"Start Open"},null,{"$f":"IF(AB136=\"\",\"\",AB136/AD136)","v":1.6782608695652175}]
[null,null,null,null,null,null,null,null,null,null,null,null,null,null,null,null,null,null,null,null,null,null,null,null,null,null,"Air End",{"$f":"CHOOSE(DA!$AB$10,AV16,AV56)","v":95},{"$f":"IF(AB137=\"\",\"\",IF(AB137>=AD137,\"≥\",\"<\"))","v":"≥"},{"$f":"CHOOSE(SR!$BQ$10,EOT,ECT)","v":92},{"$f":"CHOOSE(SR!$BQ$10,\"End Open\",\"End Closed\")","v":"End Open"},null,{"$f":"IF(AB137=\"\",\"\",AB137/AD137)","v":1.0326086956521738}]
[null,null,null,null,null,null,null,null,null,null,null,null,null,null,null,null,null,null,null,null,null,null,null,null,null,null,null,null,"Min. Act Torque =",{"$f":"MIN(AD134:AD137)","v":92},null,"Min. Act. : Req. =",{"$f":"MIN(AG134:AG137)","v":1.0326086956521738}]
[]
[]
[null,null,null,null,null,null,null,null,null,null,null,null,null,null,null,null,null,null,null,null,null,null,null,null,null,null,"Actuator Mounting for Menu"]
[null,null,null,null,null,null,null,null,null,null,null,null,null,null,null,null,null,null,null,null,null,null,null,null,null,null,"Mounting","Stem Sq."]
[null,null,null,null,null,null,null,null,null,null,null,null,null,null,null,null,null,null,null,null,null,null,null,null,null,null,{"$f":"CHOOSE(DA!$AB$10,AL12,AL52)","v":"F05/F07"},{"$f":"CHOOSE(DA!$AB$10,AM12,AM52)","v":14}]
[]
[null,null,null,null,null,null,null,null,null,null,null,null,null,null,null,null,null,null,null,null,null,null,null,null,null,null,"SR Actuator Note Table",null,null,"AB146:AC148"]
[null,null,null,null,null,null,null,null,null,null,null,null,null,null,null,null,null,null,null,null,null,null,null,null,null,null,null,"Actuator","Note"]
[null,null,null,null,null,null,null,null,null,null,null,null,null,null,null,null,null,null,null,null,null,null,null,null,null,null,1,6.5,"Non-stock; consult factory."]
[null,null,null,null,null,null,null,null,null,null,null,null,null,null,null,null,null,null,null,null,null,null,null,null,null,null,2,7.5,"Non-stock; consult factory."]
[null,null,null,null,null,null,null,null,null,null,null,null,null,null,null,null,null,null,null,null,null,null,null,null,null,null,3]
[]
[]
[null,null,null,null,null,null,null,null,null,null,null,null,null,null,null,null,null,null,null,null,null,null,null,null,null,null,{"$f":"VLOOKUP($E$135,$AB$147:$AC$149,2, FALSE)","v":{"$error":"#N/A"}}]
[null,null,null,null,null,null,null,null,null,null,null,null,null,null,null,null,null,null,null,null,null,null,null,null,null,null,{"$f":"IF(ISERROR(AA152),\"\",AA152)","v":""}]

{"sheet":"Oper","index":7,"n_rows":142,"n_cols":50,"rows_kept":142,"cut":false,"hidden":true,"merged":[[106,37,111,39],[127,37,132,39],[5,37,10,39],[26,37,31,39],[45,37,50,39],[73,37,78,39],[88,37,94,39],[10,49,10,52],[11,49,11,52],[12,49,12,52],[6,49,6,52],[7,49,7,52],[8,49,8,52],[9,49,9,52],[43,12,43,24],[43,25,43,29],[13,49,13,52],[14,49,14,52],[24,30,24,31],[15,49,15,52],[17,49,17,52],[18,49,18,52],[24,32,25,32],[71,30,71,31],[86,30,86,31],[125,30,125,31],[24,6,24,8],[24,9,24,10],[86,25,86,29],[43,6,43,8],[43,9,43,10],[24,25,24,29],[86,12,86,24],[86,6,86,8],[86,9,86,10],[125,6,125,8],[125,9,125,10],[125,12,125,24],[125,25,125,29],[3,6,3,8],[3,9,3,10],[3,30,3,31],[3,25,3,29],[104,12,104,24],[104,25,104,29],[3,12,3,24],[104,6,104,8],[104,9,104,10],[71,6,71,8],[71,9,71,10],[24,12,24,24],[71,12,71,24],[71,25,71,29],[43,30,43,31],[104,30,104,31],[125,33,126,33],[3,32,4,32],[71,32,72,32],[86,32,87,32],[104,32,105,32],[71,33,72,33],[86,33,87,33],[43,33,44,33],[43,32,44,32]]}
["Gear Operator"]
["Gear_Op_Alecto",null,null,null,null,null,"Gear_Op_Alecto"]
["Alecto Gear Operator Data Table (Table 13A)",null,null,null,null,null,"A6:AG17"]
[null,null,null,null,null,null,"Std. Handwheel",null,null,"Largest HW",null,null,"Handwheel Diameters Available, In.",null,null,null,null,null,null,null,null,null,null,null,null,"Handwheel Dia.",null,null,null,null,"Handwheel Pull",null,"All Criteria Met",null,null,"Alecto Max. HW Dia. Sel. Menu (Table 14A)"]
["Marwin No. (Relative Cost)","AT Controls No.","Gear Ratio","Mech.\nAdvan-\ntage","*Std. Torque Output\nIn-lbf","Max Torque Output\nIn-lbf","Std.\nHW Dia.\nIn.","Tot. HW\nPull @ Std Torque\nLbf","Tot. HW\nPull @ Max Torq.\nLbf","Largest HW Dia.\nIn.","Tot. HW Pull @ Max Torq.\nLbf","HW Shaft Dia",1,2,3,4,5,6,7,8,9,10,11,12,null,"Va. Torq. <= Oper. Max. Output Torque","Calc. D. for User Max Pull,\nIn.","Index No. of Next Largest Avail. HW","Next Larg-\nest Avail. HW D.\nIn.","<= Max Allow. Dia","Tot. Pull, Lbf","<= Max Pull",null,null,null,null,"HW Dia","Alecto GO Description:",null,null,null,"Gear Operator Mfgr Menu",null,null,null,null,null,"Gear Operator Note Table"]
[1,"AB 210",30,9.6999999999999993,2328,2920,6,{"$f":"E6/(G6/2*D6)","v":80},{"$f":"F6/(G6/2*D6)","v":100.34364261168386},8,{"$f":"F6/(D6*J6/2)","v":75.257731958762889},0.59,0,6,8,"NA","NA","NA","NA","NA","NA","NA","NA","NA","NA",{"$f":"IF(SOT<=F6,\"Y\",\"N\")","v":"Y"},{"$f":"2*SOT/(Menu!$P$38*D6)","v":0.29639175257731959},{"$f":"IF(OR(AA6=6,AA6=8),MATCH(AA6,M6:Y6),MATCH(AA6,M6:Y6)+1)","v":2},{"$f":"CHOOSE(AB6,$M6,$N6,$O6,$P6,$Q6,$R6,$S6,$T6,$U6,$V6,$W6,$X6,$Y6)","v":6},{"$f":"IF(AC6<=$AK$141,\"Y\",\"N\")","v":"Y"},{"$f":"SOT/($AK$141/2*D6)","v":1.3172966781214204},{"$f":"IF(AE6<=Menu!$P$38,\"Y\",\"N\")","v":"Y"},{"$f":"AND(Z6=\"Y\",AD6=\"Y\",AF6=\"Y\")","v":true},null,null,1,6,"Quarter turn worm gear operator for manual valves.",null,null,null,null,"Menu",null,null,null,null,null,"Series","Note"]
[2,"AB 550",34,9.6999999999999993,3880,8270,10,80,170.51546391752578,20,85.257731958762889,0.79,0,10,12,14,16,18,20,24,28,"NA","NA","NA","NA","Y",{"$f":"2*SOT/(Menu!$P$38*D7)","v":0.29639175257731959},{"$f":"IF(OR(AA7=10,AA7=12,AA7=14,AA7=16,AA7=18,AA7=20,AA7=24,AA7=28),MATCH(AA7,M7:Y7),MATCH(AA7,M7:Y7)+1)","v":2},10,"Y",1.3172966781214204,{"$f":"IF(AE7<=Menu!$P$38,\"Y\",\"N\")","v":"Y"},true,null,null,2,8,null,null,null,null,1,"DynaTorque DT (Manual)",null,null,null,null,1,"Q200","Q200 not suitiable for chain wheel."]
[3,"AB 880",38,12.3,5904,14350,12,79.999999999999986,194.44444444444443,30,77.777777777777771,0.79,0,10,12,14,16,18,20,24,28,30,32,"NA","NA","Y",{"$f":"2*SOT/(Menu!$P$38*D8)","v":0.23373983739837398},{"$f":"IF(OR(AA8=10,AA8=12,AA8=14,AA8=16,AA8=18,AA8=20,AA8=24,AA8=28,AA8=30,AA8=32),MATCH(AA8,M8:Y8),MATCH(AA8,M8:Y8)+1)","v":2},10,"Y",1.0388437217705511,{"$f":"IF(AE8<=Menu!$P$38,\"Y\",\"N\")","v":"Y"},true,null,null,3,10,null,null,null,null,2,"DynaTorque DT-SD (Declutch.--DA)",null,null,null,null,2,"Q400","Q400 not suitiable for chain wheel."]
[4,"AB 1250",55,13.2,8448,23380,16,80,221.40151515151516,36,98.400673400673398,0.79,0,10,12,14,16,18,20,24,28,30,32,36,"NA","Y",{"$f":"2*SOT/(Menu!$P$38*D9)","v":0.2178030303030303},{"$f":"IF(OR(AA9=10,AA9=12,AA9=14,AA9=16,AA9=18,AA9=20,AA9=24,AA9=28,AA9=30,AA9=32,AA9=36),MATCH(AA9,M9:Y9),MATCH(AA9,M9:Y9)+1)","v":2},10,"Y",0.96801346801346799,{"$f":"IF(AE9<=Menu!$P$38,\"Y\",\"N\")","v":"Y"},true,null,null,4,12,null,null,null,null,3,"DynaTorque DT-SRD (Declutch.--SR)",null,null,null,null,3,"DT1","DT1 not suitiable for chain wheel."]
[5,"AB 1250/SP4",220,53.1,33472,33472,16,78.794726930320152,78.794726930320152,16,78.794726930320152,0.79,0,10,12,14,16,"NA","NA","NA","NA","NA","NA","NA","NA","Y",{"$f":"2*SOT/(Menu!$P$38*D10)","v":5.4143126177024485E-2},{"$f":"IF(OR(AA10=10,AA10=12,AA10=14,AA10=16),MATCH(AA10,M10:Y10),MATCH(AA10,M10:Y10)+1)","v":2},10,"Y",0.24063611634233101,{"$f":"IF(AE10<=Menu!$P$38,\"Y\",\"N\")","v":"Y"},true,null,null,5,14,null,null,null,null,4,"Alecto (Manual)",null,null,null,null,4,"DT2","DT2 not suitiable for chain wheel."]
[6,"AB 1950",52,17.2,13760,36820,20,80,214.06976744186048,36,118.92764857881139,0.98,0,14,16,18,20,24,28,30,32,36,"NA","NA","NA","Y",{"$f":"2*SOT/(Menu!$P$38*D11)","v":0.16715116279069767},{"$f":"IF(OR(AA11=14,AA11=16,AA11=18,AA11=20,AA11=24,AA11=28,AA11=30,AA11=32,AA11=36),MATCH(AA11,M11:Y11),MATCH(AA11,M11:Y11)+1)","v":2},14,"Y",0.74289405684754528,{"$f":"IF(AE11<=Menu!$P$38,\"Y\",\"N\")","v":"Y"},true,null,null,6,16,null,null,null,null,5,"Pro-Gear (Manual)",null,null,null,null,5,"DT3","DT3 not suitiable for chain wheel."]
[7,"AB 1950/SP4",208,54.4,45520,60180,20,83.67647058823529,110.625,30,73.75,0.98,0,14,16,18,20,24,28,30,32,"NA","NA","NA","NA","Y",{"$f":"2*SOT/(Menu!$P$38*D12)","v":5.2849264705882353E-2},{"$f":"IF(OR(AA12=14,AA12=16,AA12=18,AA12=20,AA12=24,AA12=28,AA12=30,AA12=32),MATCH(AA12,M12:Y12),MATCH(AA12,M12:Y12)+1)","v":2},14,"Y",0.23488562091503271,{"$f":"IF(AE12<=Menu!$P$38,\"Y\",\"N\")","v":"Y"},true,null,null,7,18,null,null,null,null,6,"MasterGear (Manual)",null,null,null,null,6,"DT5","DT5 not suitiable for chain wheel."]
[8,"AB 6800",78,27.5,26400,73460,24,80,222.60606060606059,36,148.40404040404042,0.98,0,14,16,18,20,24,28,30,32,36,"NA","NA","NA","Y",{"$f":"2*SOT/(Menu!$P$38*D13)","v":0.10454545454545454},{"$f":"IF(OR(AA13=14,AA13=16,AA13=18,AA13=20,AA13=24,AA13=28,AA13=30,AA13=32,AA13=36),MATCH(AA13,M13:Y13),MATCH(AA13,M13:Y13)+1)","v":2},14,"Y",0.46464646464646464,{"$f":"IF(AE13<=Menu!$P$38,\"Y\",\"N\")","v":"Y"},true,null,null,8,20,null,null,null,null,null,null,null,null,null,null,7,"DT7","DT7 not suitiable for chain wheel."]
[9,"AB 6800/SP4",319,93.6,89568,110630,24,79.743589743589752,98.495370370370381,30,78.796296296296291,0.98,0,14,16,18,20,24,28,30,32,"NA","NA","NA","NA","Y",{"$f":"2*SOT/(Menu!$P$38*D14)","v":3.0715811965811964E-2},{"$f":"IF(OR(AA14=14,AA14=16,AA14=18,AA14=20,AA14=24,AA14=28,AA14=30,AA14=32),MATCH(AA14,M14:Y14),MATCH(AA14,M14:Y14)+1)","v":2},14,"Y",0.13651471984805319,{"$f":"IF(AE14<=Menu!$P$38,\"Y\",\"N\")","v":"Y"},true,null,null,9,24,null,null,null,null,1,{"$f":"VLOOKUP(AP14,AP7:AQ12,2,FALSE)","v":"DynaTorque DT (Manual)"},null,null,null,null,8,"M05","M05 not suitiable for chain wheel."]
[10,"A 250/SP9",705,227,218208,283200,24,80.105726872246692,103.9647577092511,30,83.171806167400888,1.18,0,14,16,18,20,24,28,30,32,"NA","NA","NA","NA","Y",{"$f":"2*SOT/(Menu!$P$38*D15)","v":1.2665198237885462E-2},{"$f":"IF(OR(AA15=14,AA15=16,AA15=18,AA15=20,AA15=24,AA15=28,AA15=30,AA15=32),MATCH(AA15,M15:Y15),MATCH(AA15,M15:Y15)+1)","v":2},14,"Y",5.6289769946157614E-2,{"$f":"IF(AE15<=Menu!$P$38,\"Y\",\"N\")","v":"Y"},true,null,null,10,28,null,null,null,null,null,null,null,null,null,null,9,"M07","M07 not suitiable for chain wheel."]
[11,"A 500/SP15",1977,400,384000,442500,24,80,92.1875,30,73.75,1.18,0,14,16,18,20,24,28,30,32,"NA","NA","NA","NA","Y",{"$f":"2*SOT/(Menu!$P$38*D16)","v":7.1875000000000003E-3},{"$f":"IF(OR(AA16=14,AA16=16,AA16=18,AA16=20,AA16=24,AA16=28,AA16=30,AA16=32),MATCH(AA16,M16:Y16),MATCH(AA16,M16:Y16)+1)","v":2},14,"Y",3.1944444444444442E-2,{"$f":"IF(AE16<=Menu!$P$38,\"Y\",\"N\")","v":"Y"},true,null,null,11,30,null,null,null,null,null,null,null,null,null,null,10,"DT3SRD","DT3SRD not suitiable for chain wheel."]
[12,"Consult Eng.",99999,99999,99999,999999,99999,2.000020000200002E-5,2.0000380005600073E-4,99999,2.0000380005600073E-4,99999,0,99,99,99,99,99,99,99,99,99,99,99,"NA","Y",{"$f":"2*SOT/(Menu!$P$38*D17)","v":2.875028750287503E-5},{"$f":"MATCH(AA17,M17:Y17)","v":1},0,"Y",1.2777905556833347E-4,{"$f":"IF(AE17<=Menu!$P$38,\"Y\",\"N\")","v":"Y"},true,null,null,12,32]
["Alecto (AT Controls)",null,null,null,null,null,null,null,null,null,null,null,null,null,null,null,null,null,null,null,null,null,null,null,null,null,null,null,null,null,null,null,null,null,null,13,36,null,null,null,null,null,null,null,null,null,null,null,null,{"$f":"VLOOKUP($B$128,$AW$7:$AX$16,2, FALSE)","v":"DT3 not suitiable for chain wheel."}]
["Bold = handwheel sizes on Marwin Dwg. 27-05390",null,null,null,null,null,null,{"$f":"G6*D6*80/2","v":2328},null,{"$f":"F6/D6","v":301.03092783505156},null,null,null,null,null,null,null,null,null,null,null,null,null,null,null,null,null,null,null,null,null,null,null,null,null,null,null,null,null,null,null,null,null,null,null,null,null,null,null,{"$f":"IF(ISERROR(AX18),\"\",AX18)","v":"DT3 not suitiable for chain wheel."}]
["*Std. Torque output is torque output for 80 lb HW pull with Std. Dia. HW.",null,null,null,null,null,null,{"$f":"G7*D7*80/2","v":3880},null,{"$f":"F7/D7","v":852.57731958762895}]
[]
[]
["Gear_Op_ProGear",null,null,null,null,null,"Gear_Op_ProGear"]
["Pro-Gear Gear Operator Data Table (Table 13B)",null,null,null,null,null,"A27:AG35"]
[null,null,null,null,null,null,"Std. Handwheel",null,null,"Largest HW",null,null,"***Handwheel Diameters Available, In.",null,null,null,null,null,null,null,null,null,null,null,null,"Handwheel Dia.",null,null,null,null,"Handwheel Pull",null,"All Criteria Met",null,null,"Pro-Gear Max. HW Dia. Sel. Menu (Table 14B)"]
["Marwin No. (Relative Cost)","Pro-Gear No.","Gear Ratio","Mech.\nAdvan-\ntage","*Std. Torque Output\nIn-lbf","Max Torque Output\nIn-lbf","**Std.\nHW Dia.\nIn.","Tot. HW\nPull @ Std Torque\nLbf","Tot. HW\nPull @ Max Torq.\nLbf","***\nLargest HW Dia.\nIn.","Tot. HW Pull @ Max Torq.\nLbf","HW Shaft Dia",1,2,3,4,5,6,7,8,9,10,11,12,null,"Va. Torq. <= Oper. Max. Output Torque","Calc. D. for User Max Pull,\nIn.","Index No. of Next Largest Avail. HW","Next Larg-\nest Avail. HW D.\nIn.","<= Max Allow. Dia","Tot. Pull, Lbf","<= Max Pull",null,null,null,null,"HW Dia","Pro-Gear GO Description:"]
[1,"Q200",40,11.9,1770,1770,4.9000000000000004,{"$f":"E27/(G27/2*D27)","v":60.709998285028284},{"$f":"F27/(G27/2*D27)","v":60.709998285028284},8,{"$f":"F27/(D27*J27/2)","v":37.184873949579831},0.47,0,4.92,6.3,"NA","NA","NA","NA","NA","NA","NA","NA","NA","NA",{"$f":"IF(SOT<=F27,\"Y\",\"N\")","v":"Y"},{"$f":"2*SOT/(Menu!$P$38*D27)","v":0.24159663865546219},{"$f":"IF(OR(AA27=4.9,AA27=6.3),MATCH(AA27,M27:Y27),MATCH(AA27,M27:Y27)+1)","v":2},{"$f":"CHOOSE(AB27,$M27,$N27,$O27,$P27,$Q27,$R27,$S27,$T27,$U27,$V27,$W27,$X27,$Y27)","v":4.92},{"$f":"IF(AC27<=$AK$141,\"Y\",\"N\")","v":"Y"},{"$f":"SOT/($AK$141/2*D27)","v":1.0737628384687208},{"$f":"IF(AE27<=Menu!$P$38,\"Y\",\"N\")","v":"Y"},{"$f":"AND(Z27=\"Y\",AD27=\"Y\",AF27=\"Y\")","v":true},null,null,1,5,"Quarter turn worm gear operator for manual valves."]
[2,"Q400",44,12.8,3072,3540,6.3,76.19047619047619,87.797619047619051,8,69.140625,0.47,0,4.92,6.3,7.87,"NA","NA","NA","NA","NA","NA","NA","NA","NA","Y",{"$f":"2*SOT/(Menu!$P$38*D28)","v":0.224609375},{"$f":"IF(OR(AA28=4.9,AA28=6.3,AA28=7.9),MATCH(AA28,M28:Y28),MATCH(AA28,M28:Y28)+1)","v":2},4.92,"Y",0.99826388888888884,{"$f":"IF(AE28<=Menu!$P$38,\"Y\",\"N\")","v":"Y"},true,null,null,2,6]
[3,"Q800",40,13.3,5320,7080,9.8000000000000007,81.632653061224488,108.63894429952431,16,66.541353383458642,0.59,0,7.87,9.84,12.4,15.7,"NA","NA","NA","NA","NA","NA","NA","NA","Y",{"$f":"2*SOT/(Menu!$P$38*D29)","v":0.21616541353383459},{"$f":"IF(OR(AA29=7.9,AA29=9.8,AA29=12.4,AA29=15.7),MATCH(AA29,M29:Y29),MATCH(AA29,M29:Y29)+1)","v":2},7.87,"Y",0.960735171261487,{"$f":"IF(AE29<=Menu!$P$38,\"Y\",\"N\")","v":"Y"},true,null,null,3,8]
[4,"Q2000",48,15.3,9790,17700,15.7,81.512010324299567,147.3710503309604,20,115.68627450980392,0.79,0,12.4,15.7,19.7,23.6,27.6,31.5,"NA","NA","NA","NA","NA","NA","Y",{"$f":"2*SOT/(Menu!$P$38*D30)","v":0.18790849673202614},{"$f":"IF(OR(AA30=12.4,AA30=15.7,AA30=19.7,AA30=23.6, AA30=27.6,AA30=31.5),MATCH(AA30,M30:Y30),MATCH(AA30,M30:Y30)+1)","v":2},12.4,"Y",0.83514887436456053,{"$f":"IF(AE30<=Menu!$P$38,\"Y\",\"N\")","v":"Y"},true,null,null,4,10]
[6,"Q4000/PR3",216,68.400000000000006,43750,57525,15.75,81.221572449642608,106.79476468950152,24,70.084064327485379,0.79,0,11.8,15.7,19.7,23.6,"NA","NA","NA","NA","NA","NA","NA","NA","Y",{"$f":"2*SOT/(Menu!$P$38*D31)","v":4.203216374269006E-2},{"$f":"IF(OR(AA31=11.8,AA31=15.7,AA31=19.7,AA31=23.6),MATCH(AA31,M31:Y31),MATCH(AA31,M31:Y31)+1)","v":2},11.8,"Y",0.18680961663417803,{"$f":"IF(AE31<=Menu!$P$38,\"Y\",\"N\")","v":"Y"},true,null,null,5,12]
[8,"Q8000/PR3",216,96,92200,106200,23.62,81.322325712672878,93.670618120237094,24,92.1875,0.79,0,15.7,19.7,23.6,27.6,"NA","NA","NA","NA","NA","NA","NA","NA","Y",{"$f":"2*SOT/(Menu!$P$38*D32)","v":2.9947916666666668E-2},{"$f":"IF(OR(AA32=15.7,AA32=19.7,AA32=23.6,AA32=27.6),MATCH(AA32,M32:Y32),MATCH(AA32,M32:Y32)+1)","v":2},15.7,"Y",0.13310185185185186,{"$f":"IF(AE32<=Menu!$P$38,\"Y\",\"N\")","v":"Y"},true,null,null,6,16]
[9,"Consult Eng.",99999,99999,99999,999999,99999,2.000020000200002E-5,2.0000380005600073E-4,99999,2.0000380005600073E-4,99999,0,99,99,99,99,99,99,99,99,99,99,99,"NA","Y",{"$f":"2*SOT/(Menu!$P$38*D33)","v":2.875028750287503E-5},{"$f":"MATCH(AA33,M33:Y33)","v":1},0,"Y",1.2777905556833347E-4,{"$f":"IF(AE33<=Menu!$P$38,\"Y\",\"N\")","v":"Y"},true,null,null,7,20]
[5,"Q4000",72,21.6,17275,35400,19.690000000000001,81.236010006959717,166.4691608825687,24,136.57407407407405,0.79,0,19.7,23.6,27.6,31.5,"NA","NA","NA","NA","NA","NA","NA","NA","Y",{"$f":"2*SOT/(Menu!$P$38*D34)","v":0.13310185185185186},{"$f":"IF(OR(AA34=19.7,AA34=23.6,AA34=27.6,AA34=31.5),MATCH(AA34,M34:Y34),MATCH(AA34,M34:Y34)+1)","v":2},19.7,"N",0.59156378600823045,{"$f":"IF(AE34<=Menu!$P$38,\"Y\",\"N\")","v":"Y"},false,null,null,8,24]
[7,"Q8000",72,31.4,30150,70800,23.62,81.303224623416412,190.92100508583354,32,140.92356687898089,0.98,0,19.7,23.6,27.6,31.5,"NA","NA","NA","NA","NA","NA","NA","NA","Y",{"$f":"2*SOT/(Menu!$P$38*D35)","v":9.1560509554140121E-2},{"$f":"IF(OR(AA35=19.7,AA35=23.64,AA35=27.6,AA35=31.5),MATCH(AA35,M35:Y35),MATCH(AA35,M35:Y35)+1)","v":2},19.7,"N",0.40693559801840062,{"$f":"IF(AE35<=Menu!$P$38,\"Y\",\"N\")","v":"Y"},false,null,null,9,28]
["Pro-Gear (AT Controls)",null,null,null,null,null,null,null,null,null,null,null,null,null,null,null,null,null,null,null,null,null,null,null,null,null,null,null,null,null,null,null,null,null,null,10,32]
["Yellow = AT Controls / Pro-Gear \"recommended\" hwl size.",null,null,null,null,null,"Q200 4.9 was 6.3; Q2000 15.7 was 12.4  JJH  11/6/04",null,null,null,null,null,null,null,null,null,null,null,null,null,null,null,null,null,null,null,null,null,null,null,null,null,null,null,null,11,"--"]
["*Std. Torque output is torque output for 80 lb HW pull with Std. Dia. HW.",null,null,null,null,null,null,null,null,null,null,null,null,null,null,null,null,null,null,null,null,null,null,null,null,null,null,null,null,null,null,null,null,null,null,12,"--"]
["Data from Pro-Gear by SymTech Bulletin dated 09/2001",null,null,null,null,null,null,null,null,null,null,null,null,null,null,null,null,null,null,null,null,null,null,null,null,null,null,null,null,null,null,null,null,null,null,13,"--"]
[]
[]
["Gear_Op_DT",null,null,null,null,null,"Gear_Op_DT"]
["DynaTorque DT Gear Operator Data Table (Table 13C)",null,null,null,null,null,"A46:AH54"]
[null,null,null,null,null,null,"Std. Handwheel",null,null,"Largest HW",null,null,"Handwheel Diameters Available, In.",null,null,null,null,null,null,null,null,null,null,null,null,"Handwheel Dia.",null,null,null,null,"Handwheel Pull",null,"All Criteria Met","Mount",null,"DynaTorque Max. HW Dia. Sel. Menu (Table 14C)"]
["Marwin No. (Relative Cost)","Dyna-\nTorque\nNo.**","Gear Ratio","Mech.\nAdvan-\ntage","*Std. Torque Output\nIn-lbf","Max Torque Output\nIn-lbf","Std.\nHW Dia.\nIn.","Tot. HW\nPull @ Std Torque\nLbf","Tot. HW\nPull @ Max Torq.\nLbf","Largest HW Dia.\nIn.","Tot. HW Pull @ Max Torq.\nLbf","HW Shaft Dia",1,2,3,4,5,6,7,8,9,10,11,12,null,"Va. Torq. <= Oper. Max. Output Torque","Calc. D. for User Max Pull,\nIn.","Index No. of Next Largest Avail. HW","Next Larg-\nest Avail. HW D.\nIn.","<= Max Allow. Dia","Tot. Pull, Lbf","<= Max Pull",null,null,null,null,"HW Dia","DynaTorque DT GO Description:"]
[1,"DT3",30,8.1,{"$f":"G46*D46*80/2","v":3887.9999999999995},4500,12,{"$f":"E46/(G46/2*D46)","v":80},{"$f":"F46/(G46/2*D46)","v":92.592592592592609},18,{"$f":"F46/(D46*J46/2)","v":61.728395061728399},0.625,0,6,8,10,12,14,18,"NA","NA","NA","NA","NA","NA",{"$f":"IF(SOT<=F46,\"Y\",\"N\")","v":"Y"},{"$f":"2*SOT/(Menu!$P$38*D46)","v":0.35493827160493829},{"$f":"IF(OR(AA46=10,AA46=12,AA46=14,AA46=16,AA46=18,AA46=20,AA46=24,AA46=28),MATCH(AA46,M46:Y46),MATCH(AA46,M46:Y46)+1)","v":2},{"$f":"CHOOSE(AB46,$M46,$N46,$O46,$P46,$Q46,$R46,$S46,$T46,$U46,$V46,$W46,$X46,$Y46)","v":6},{"$f":"IF(AC46<=$AK$141,\"Y\",\"N\")","v":"Y"},{"$f":"SOT/($AK$141/2*D46)","v":1.5775034293552814},{"$f":"IF(AE46<=Menu!$P$38,\"Y\",\"N\")","v":"Y"},{"$f":"AND(Z46=\"Y\",AD46=\"Y\",AF46=\"Y\")","v":true},"0.38-16 on 3.25 BC",null,1,6,"Quarter turn worm gear operator for manual valves."]
[2,"DT7",48,12.96,7257.6,10000,14,80,110.22927689594357,18,85.733882030178322,0.625,0,6,8,10,12,14,18,"NA","NA","NA","NA","NA","NA","Y",{"$f":"2*SOT/(Menu!$P$38*D47)","v":0.22183641975308638},{"$f":"IF(OR(AA47=10,AA47=12,AA47=14,AA47=16,AA47=18,AA47=20,AA47=24,AA47=28,AA47=30,AA47=32),MATCH(AA47,M47:Y47),MATCH(AA47,M47:Y47)+1)","v":2},6,"Y",0.98593964334705064,{"$f":"IF(AE47<=Menu!$P$38,\"Y\",\"N\")","v":"Y"},true,"F12",null,2,8]
[3,"DT12",57,13.68,10944,16000,20,80,116.95906432748536,36,64.977257959714095,1,0,6,8,10,12,14,18,20,24,30,36,"NA","NA","Y",{"$f":"2*SOT/(Menu!$P$38*D48)","v":0.21016081871345027},{"$f":"IF(OR(AA48=10,AA48=12,AA48=14,AA48=16),MATCH(AA48,M48:Y48),MATCH(AA48,M48:Y48)+1)","v":2},6,"Y",0.93404808317089016,{"$f":"IF(AE48<=Menu!$P$38,\"Y\",\"N\")","v":"Y"},true,"F12",null,3,10]
[4,"DT21",60,22.5,21600,26000,24,80,96.296296296296291,36,64.197530864197532,1,0,6,8,10,12,14,18,20,24,30,36,"NA","NA","Y",{"$f":"2*SOT/(Menu!$P$38*D49)","v":0.12777777777777777},{"$f":"IF(OR(AA49=14,AA49=16,AA49=18,AA49=20,AA49=24,AA49=28,AA49=30,AA49=32),MATCH(AA49,M49:Y49),MATCH(AA49,M49:Y49)+1)","v":2},6,"Y",0.5679012345679012,{"$f":"IF(AE49<=Menu!$P$38,\"Y\",\"N\")","v":"Y"},true,"F14",null,4,12]
[5,"DT36",53,19,22800,36000,30,80,126.31578947368421,36,105.26315789473684,1,0,6,8,10,12,14,18,20,24,30,36,"NA","NA","Y",{"$f":"2*SOT/(Menu!$P$38*D50)","v":0.15131578947368421},{"$f":"IF(OR(AA50=14,AA50=16,AA50=18,AA50=20,AA50=24,AA50=28,AA50=30,AA50=32,AA50=36),MATCH(AA50,M50:Y50),MATCH(AA50,M50:Y50)+1)","v":2},6,"Y",0.67251461988304095,{"$f":"IF(AE50<=Menu!$P$38,\"Y\",\"N\")","v":"Y"},true,"F16",null,5,14]
[6,"DT50",212,60.8,43775.999999999993,50000,18,80,91.374269005847964,36,45.687134502923982,1,0,6,8,10,12,14,18,20,24,30,36,"NA","NA","Y",{"$f":"2*SOT/(Menu!$P$38*D51)","v":4.7286184210526314E-2},{"$f":"IF(OR(AA51=14,AA51=16,AA51=18,AA51=20,AA51=24,AA51=28,AA51=30,AA51=32),MATCH(AA51,M51:Y51),MATCH(AA51,M51:Y51)+1)","v":2},6,"Y",0.21016081871345033,{"$f":"IF(AE51<=Menu!$P$38,\"Y\",\"N\")","v":"Y"},true,"F16",null,6,18]
[7,"DT54",318,91.2,72960,63000,20,80,69.078947368421055,36,38.377192982456137,1,0,6,8,10,12,14,18,20,24,30,36,"NA","NA","Y",{"$f":"2*SOT/(Menu!$P$38*D52)","v":3.1524122807017545E-2},{"$f":"IF(OR(AA52=14,AA52=16,AA52=18,AA52=20,AA52=24,AA52=28,AA52=30,AA52=32),MATCH(AA52,M52:Y52),MATCH(AA52,M52:Y52)+1)","v":2},6,"Y",0.14010721247563351,{"$f":"IF(AE52<=Menu!$P$38,\"Y\",\"N\")","v":"Y"},true,"F16",null,7,20]
[8,"DT60",60,15.6,18720,60000,30,80,256.41025641025641,36,213.67521367521366,1,0,6,8,10,12,14,18,20,24,30,36,"NA","NA","Y",{"$f":"2*SOT/(Menu!$P$38*D53)","v":0.18429487179487181},{"$f":"IF(OR(AA53=14,AA53=16,AA53=18,AA53=20,AA53=24,AA53=28,AA53=30,AA53=32),MATCH(AA53,M53:Y53),MATCH(AA53,M53:Y53)+1)","v":2},6,"Y",0.81908831908831903,{"$f":"IF(AE53<=Menu!$P$38,\"Y\",\"N\")","v":"Y"},true,"0.75-10 on 10.25 BC",null,8,24]
[9,"Consult Eng.",99999,99999,99999,999999,99999,2.000020000200002E-5,2.0000380005600073E-4,99999,2.0000380005600073E-4,99999,0,99,99,99,99,99,99,99,99,99,99,99,"NA","Y",{"$f":"2*SOT/(Menu!$P$38*D54)","v":2.875028750287503E-5},{"$f":"MATCH(AA54,M54:Y54)","v":1},0,"Y",1.2777905556833347E-4,{"$f":"IF(AE54<=Menu!$P$38,\"Y\",\"N\")","v":"Y"},true,"--",null,9,30]
[null,null,null,null,null,null,null,null,null,null,null,null,null,null,null,null,null,null,null,null,null,null,null,null,null,null,null,null,null,null,null,null,null,null,null,10,36]
["DynaTorque DT Not Used"]
[1,"DT1",30,8.1,{"$f":"G57*D57*80/2","v":1943.9999999999998},1500,6,{"$f":"E57/(G57/2*D57)","v":80},{"$f":"F57/(G57/2*D57)","v":61.728395061728399},18,{"$f":"F57/(D57*J57/2)","v":20.5761316872428},0.623,0,6,8,10,12,14,18,"NA","NA","NA","NA","NA","NA",{"$f":"IF(SOT<=F57,\"Y\",\"N\")","v":"Y"},{"$f":"2*SOT/(Menu!$P$38*D57)","v":0.35493827160493829},{"$f":"IF(OR(AA57=6,AA57=8),MATCH(AA57,M57:Y57),MATCH(AA57,M57:Y57)+1)","v":2},{"$f":"CHOOSE(AB57,$M57,$N57,$O57,$P57,$Q57,$R57,$S57,$T57,$U57,$V57,$W57,$X57,$Y57)","v":6},{"$f":"IF(AC57<=$AK$141,\"Y\",\"N\")","v":"Y"},{"$f":"SOT/($AK$141/2*D57)","v":1.5775034293552814},{"$f":"IF(AE57<=Menu!$P$38,\"Y\",\"N\")","v":"Y"},{"$f":"AND(Z57=\"Y\",AD57=\"Y\",AF57=\"Y\")","v":true}]
[1,"DT2",30,8.1,{"$f":"G58*D58*62/2","v":2008.8},2000,8,{"$f":"E58/(G58/2*D58)","v":62},{"$f":"F58/(G58/2*D58)","v":61.728395061728399},12,{"$f":"F58/(D58*J58/2)","v":41.152263374485599},0.625,0,6,8,10,12,14,18,"NA","NA","NA","NA","NA","NA",{"$f":"IF(SOT<=F58,\"Y\",\"N\")","v":"Y"},{"$f":"2*SOT/(Menu!$P$38*D58)","v":0.35493827160493829},{"$f":"IF(OR(AA58=6,AA58=8),MATCH(AA58,M58:Y58),MATCH(AA58,M58:Y58)+1)","v":2},{"$f":"CHOOSE(AB58,$M58,$N58,$O58,$P58,$Q58,$R58,$S58,$T58,$U58,$V58,$W58,$X58,$Y58)","v":6},{"$f":"IF(AC58<=$AK$141,\"Y\",\"N\")","v":"Y"},{"$f":"SOT/($AK$141/2*D58)","v":1.5775034293552814},{"$f":"IF(AE58<=Menu!$P$38,\"Y\",\"N\")","v":"Y"},{"$f":"AND(Z58=\"Y\",AD58=\"Y\",AF58=\"Y\")","v":true}]
[3,"DT5",48,12.96,{"$f":"G59*D59*77/2","v":4989.6000000000013},5000,10,{"$f":"E59/(G59/2*D59)","v":77},{"$f":"F59/(G59/2*D59)","v":77.160493827160479},18,{"$f":"F59/(D59*J59/2)","v":42.866941015089161},0.625,0,6,8,10,12,14,18,"NA","NA","NA","NA","NA","NA",{"$f":"IF(SOT<=F59,\"Y\",\"N\")","v":"Y"},{"$f":"2*SOT/(Menu!$P$38*D59)","v":0.22183641975308638},{"$f":"IF(OR(AA59=10,AA59=12,AA59=14,AA59=16,AA59=18,AA59=20,AA59=24,AA59=28),MATCH(AA59,M59:Y59),MATCH(AA59,M59:Y59)+1)","v":2},{"$f":"CHOOSE(AB59,$M59,$N59,$O59,$P59,$Q59,$R59,$S59,$T59,$U59,$V59,$W59,$X59,$Y59)","v":6},{"$f":"IF(AC59<=$AK$141,\"Y\",\"N\")","v":"Y"},{"$f":"SOT/($AK$141/2*D59)","v":0.98593964334705064},{"$f":"IF(AE59<=Menu!$P$38,\"Y\",\"N\")","v":"Y"},{"$f":"AND(Z59=\"Y\",AD59=\"Y\",AF59=\"Y\")","v":true}]
[5,"DT8",30,8.1,{"$f":"G60*D60*80/2","v":5831.9999999999991},8000,18,{"$f":"E60/(G60/2*D60)","v":80},{"$f":"F60/(G60/2*D60)","v":109.73936899862827},36,{"$f":"F60/(D60*J60/2)","v":54.869684499314133},1,0,6,8,10,12,14,18,20,24,30,36,"NA","NA",{"$f":"IF(SOT<=F60,\"Y\",\"N\")","v":"Y"},{"$f":"2*SOT/(Menu!$P$38*D60)","v":0.35493827160493829},{"$f":"IF(OR(AA60=10,AA60=12,AA60=14,AA60=16,AA60=18,AA60=20,AA60=24,AA60=28,AA60=30,AA60=32,AA60=36),MATCH(AA60,M60:Y60),MATCH(AA60,M60:Y60)+1)","v":2},{"$f":"CHOOSE(AB60,$M60,$N60,$O60,$P60,$Q60,$R60,$S60,$T60,$U60,$V60,$W60,$X60,$Y60)","v":6},{"$f":"IF(AC60<=$AK$141,\"Y\",\"N\")","v":"Y"},{"$f":"SOT/($AK$141/2*D60)","v":1.5775034293552814},{"$f":"IF(AE60<=Menu!$P$38,\"Y\",\"N\")","v":"Y"},{"$f":"AND(Z60=\"Y\",AD60=\"Y\",AF60=\"Y\")","v":true}]
[7,"DT16",44,11.44,{"$f":"G61*D61*80/2","v":10982.4},16000,24,{"$f":"E61/(G61/2*D61)","v":80},{"$f":"F61/(G61/2*D61)","v":116.55011655011656},36,{"$f":"F61/(D61*J61/2)","v":77.700077700077699},1,0,6,8,10,12,14,18,20,24,30,36,"NA","NA",{"$f":"IF(SOT<=F61,\"Y\",\"N\")","v":"Y"},{"$f":"2*SOT/(Menu!$P$38*D61)","v":0.25131118881118886},{"$f":"IF(OR(AA61=14,AA61=16,AA61=18,AA61=20,AA61=24,AA61=28,AA61=30,AA61=32,AA61=36),MATCH(AA61,M61:Y61),MATCH(AA61,M61:Y61)+1)","v":2},{"$f":"CHOOSE(AB61,$M61,$N61,$O61,$P61,$Q61,$R61,$S61,$T61,$U61,$V61,$W61,$X61,$Y61)","v":6},{"$f":"IF(AC61<=$AK$141,\"Y\",\"N\")","v":"Y"},{"$f":"SOT/($AK$141/2*D61)","v":1.1169386169386171},{"$f":"IF(AE61<=Menu!$P$38,\"Y\",\"N\")","v":"Y"},{"$f":"AND(Z61=\"Y\",AD61=\"Y\",AF61=\"Y\")","v":true}]
[]
[]
["Ref DynaTorque dwg 33-20XX 12/19/03, 33-22XX 7/13/03, 33-26XX 7/13/03, 33-25XX 7/13/03, 33-28XX 7/13/03, 33-27XX 7/13/03, 33-41XX 7/13/03, 33-42XX 7/31/03, 33-44XXA 7/30/03, 33-43XXA 7/31/03, 33-32XX 7/13/03"]
["Yellow = DynaTorque recommended handwheel dia."]
["*Std. Torque output is torque output for 80 lb HW pull with Std. Dia. HW except DT2 & DT5."]
["**DT2 & DT5 are aluminum housing (Dynatorque Basic Series).  Others are cast iron housing (Dynatorque Commerical Grade)"]
[]
[]
["Gear_Op_DTSD",null,null,null,null,null,"Gear_Op_DTSD"]
["DynaTorque DT-SD Gear Operator Data Table (Table 13C)",null,null,null,null,null,"A74:AH81"]
[null,null,null,null,null,null,"Std. Handwheel",null,null,"Largest HW",null,null,"Handwheel Diameters Available, In.",null,null,null,null,null,null,null,null,null,null,null,null,"Handwheel Dia.",null,null,null,null,"Handwheel Pull",null,"All Criteria Met","Mount",null,"DynaTorque Max. HW Dia. Sel. Menu (Table 14C)"]
["Marwin No. (Relative Cost)","Dyna-\nTorque\nNo.**","Gear Ratio","Mech.\nAdvan-\ntage","*Std. Torque Output\nIn-lbf","Max Torque Output\nIn-lbf","Std.\nHW Dia.\nIn.","Tot. HW\nPull @ Std Torque\nLbf","Tot. HW\nPull @ Max Torq.\nLbf","Largest HW Dia.\nIn.","Tot. HW Pull @ Max Torq.\nLbf","HW Shaft Dia",1,2,3,4,5,6,7,8,9,10,11,12,null,"Va. Torq. <= Oper. Max. Output Torque","Calc. D. for User Max Pull,\nIn.","Index No. of Next Largest Avail. HW","Next Larg-\nest Avail. HW D.\nIn.","<= Max Allow. Dia","Tot. Pull, Lbf","<= Max Pull",null,null,null,null,"HW Dia","DynaTorque DT-SD GO Description:"]
[1,"DT3SD",30,8.1,{"$f":"G74*D74*62/2","v":3013.2},3000,12,{"$f":"E74/(G74/2*D74)","v":62},{"$f":"F74/(G74/2*D74)","v":61.728395061728399},18,{"$f":"F74/(D74*J74/2)","v":41.152263374485599},0.625,0,6,8,10,12,14,18,"NA","NA","NA","NA","NA","NA",{"$f":"IF(SOT<=F74,\"Y\",\"N\")","v":"Y"},{"$f":"2*SOT/(Menu!$P$38*D74)","v":0.35493827160493829},{"$f":"IF(OR(AA74=6,AA74=8),MATCH(AA74,M74:Y74),MATCH(AA74,M74:Y74)+1)","v":2},{"$f":"CHOOSE(AB74,$M74,$N74,$O74,$P74,$Q74,$R74,$S74,$T74,$U74,$V74,$W74,$X74,$Y74)","v":6},{"$f":"IF(AC74<=$AK$141,\"Y\",\"N\")","v":"Y"},{"$f":"SOT/($AK$141/2*D74)","v":1.5775034293552814},{"$f":"IF(AE74<=Menu!$P$38,\"Y\",\"N\")","v":"Y"},{"$f":"AND(Z74=\"Y\",AD74=\"Y\",AF74=\"Y\")","v":true},"F07",null,1,6,"Quarter turn \"sandwich\" declutching worm gear operator for manual overide of double acting pneumatic actuators in both directions."]
[2,"DT7SD",48,12.96,{"$f":"G75*D75*80/2","v":7257.6},7000,14,80,77.160493827160494,18,60.013717421124824,0.625,0,6,8,10,12,14,18,"NA","NA","NA","NA","NA","NA","Y",{"$f":"2*SOT/(Menu!$P$38*D75)","v":0.22183641975308638},{"$f":"IF(OR(AA75=10,AA75=12,AA75=14,AA75=16,AA75=18,AA75=20,AA75=24,AA75=28),MATCH(AA75,M75:Y75),MATCH(AA75,M75:Y75)+1)","v":2},6,"Y",0.98593964334705064,{"$f":"IF(AE75<=Menu!$P$38,\"Y\",\"N\")","v":"Y"},true,"F10",null,2,8]
[3,"DT12SD",57,13.68,{"$f":"G76*D76*77/2","v":10533.6},12000,20,77,87.719298245614027,36,48.732943469785575,0.75,0,6,8,10,12,14,18,20,24,30,36,"NA","NA","Y",{"$f":"2*SOT/(Menu!$P$38*D76)","v":0.21016081871345027},{"$f":"IF(OR(AA76=10,AA76=12,AA76=14,AA76=16,AA76=18,AA76=20,AA76=24,AA76=28),MATCH(AA76,M76:Y76),MATCH(AA76,M76:Y76)+1)","v":2},6,"Y",0.93404808317089016,{"$f":"IF(AE76<=Menu!$P$38,\"Y\",\"N\")","v":"Y"},true,"F12",null,3,10]
[4,"DT21SD",60,13.2,{"$f":"G77*D77*80/2","v":12671.999999999998},21000,24,80,132.57575757575759,36,88.383838383838381,0.75,0,6,8,10,12,14,18,20,24,30,36,"NA","NA","Y",{"$f":"2*SOT/(Menu!$P$38*D77)","v":0.2178030303030303},{"$f":"IF(OR(AA77=10,AA77=12,AA77=14,AA77=16,AA77=18,AA77=20,AA77=24,AA77=28,AA77=30,AA77=32),MATCH(AA77,M77:Y77),MATCH(AA77,M77:Y77)+1)","v":2},6,"Y",0.96801346801346799,{"$f":"IF(AE77<=Menu!$P$38,\"Y\",\"N\")","v":"Y"},true,"F14",null,4,12]
[5,"DT36SD",53,13.25,{"$f":"G78*D78*80/2","v":15900},36000,30,80,181.1320754716981,36,150.9433962264151,1,0,6,8,10,12,14,18,20,24,30,36,"NA","NA","Y",{"$f":"2*SOT/(Menu!$P$38*D78)","v":0.21698113207547171},{"$f":"IF(OR(AA78=10,AA78=12,AA78=14,AA78=16,AA78=18,AA78=20,AA78=24,AA78=28,AA78=30,AA78=32,AA78=36),MATCH(AA78,M78:Y78),MATCH(AA78,M78:Y78)+1)","v":2},6,"Y",0.96436058700209648,{"$f":"IF(AE78<=Menu!$P$38,\"Y\",\"N\")","v":"Y"},true,"F16",null,5,14]
[6,"DT50SD",212,34.450000000000003,{"$f":"G79*D79*80/2","v":24804},50000,18,80,161.26431220770843,36,80.632156103854214,1,0,6,8,10,12,14,18,20,24,30,36,"NA","NA","Y",{"$f":"2*SOT/(Menu!$P$38*D79)","v":8.3454281567489116E-2},{"$f":"IF(OR(AA79=10,AA79=12,AA79=14,AA79=16),MATCH(AA79,M79:Y79),MATCH(AA79,M79:Y79)+1)","v":2},6,"Y",0.37090791807772938,{"$f":"IF(AE79<=Menu!$P$38,\"Y\",\"N\")","v":"Y"},true,"F16",null,6,18]
[7,"DT54SD",318,51.68,{"$f":"G80*D80*80/2","v":41344},63000,20,80,121.90402476780187,36,67.724458204334368,1,0,6,8,10,12,14,18,20,24,30,36,"NA","NA","Y",{"$f":"2*SOT/(Menu!$P$38*D80)","v":5.5630804953560375E-2},{"$f":"IF(OR(AA80=14,AA80=16,AA80=18,AA80=20,AA80=24,AA80=28,AA80=30,AA80=32,AA80=36),MATCH(AA80,M80:Y80),MATCH(AA80,M80:Y80)+1)","v":2},6,"Y",0.24724802201582388,{"$f":"IF(AE80<=Menu!$P$38,\"Y\",\"N\")","v":"Y"},true,"F16",null,7,20]
[8,"Consult Eng.",99999,99999,99999,999999,99999,2.000020000200002E-5,2.0000380005600073E-4,99999,2.0000380005600073E-4,99999,0,99,99,99,99,99,99,99,99,99,99,99,"NA","Y",{"$f":"2*SOT/(Menu!$P$38*D81)","v":2.875028750287503E-5},{"$f":"MATCH(AA81,M81:Y81)","v":1},0,"Y",1.2777905556833347E-4,{"$f":"IF(AE81<=Menu!$P$38,\"Y\",\"N\")","v":"Y"},true,null,null,8,24]
[null,null,null,null,null,null,null,null,null,null,null,null,null,null,null,null,null,null,null,null,null,null,null,null,null,null,null,null,null,null,null,null,null,null,null,9,30]
[null,null,null,null,null,null,null,null,null,null,null,null,null,null,null,null,null,null,null,null,null,null,null,null,null,null,null,null,null,null,null,null,null,null,null,10,36]
[]
["Gear_Op_DTSRD",null,null,null,null,null,"Gear_Op_DTSRD"]
["DynaTorque DT-SRD Gear Operator Data Table (Table 13C)",null,null,null,null,null,"A89:AH96"]
[null,null,null,null,null,null,"Std. Handwheel",null,null,"Largest HW",null,null,"Handwheel Diameters Available, In.",null,null,null,null,null,null,null,null,null,null,null,null,"Handwheel Dia.",null,null,null,null,"Handwheel Pull",null,"All Criteria Met","Mount",null,"DynaTorque Max. HW Dia. Sel. Menu (Table 14C)"]
["Marwin No. (Relative Cost)","Dyna-\nTorque\nNo.**","Gear Ratio","Mech.\nAdvan-\ntage","*Std. Torque Output\nIn-lbf","Max Torque Output\nIn-lbf","Std.\nHW Dia.\nIn.","Tot. HW\nPull @ Std Torque\nLbf","Tot. HW\nPull @ Max Torq.\nLbf","Largest HW Dia.\nIn.","Tot. HW Pull @ Max Torq.\nLbf","HW Shaft Dia",1,2,3,4,5,6,7,8,9,10,11,12,null,"Va. Torq. <= Oper. Max. Output Torque","Calc. D. for User Max Pull,\nIn.","Index No. of Next Largest Avail. HW","Next Larg-\nest Avail. HW D.\nIn.","<= Max Allow. Dia","Tot. Pull, Lbf","<= Max Pull",null,null,null,null,"HW Dia","DynaTorque DT-SRD GO Description:"]
[1,"DT3SRD",30,8.1,{"$f":"G89*D89*62/2","v":2511},3000,10,{"$f":"E89/(G89/2*D89)","v":62},{"$f":"F89/(G89/2*D89)","v":74.074074074074076},18,{"$f":"F89/(D89*J89/2)","v":41.152263374485599},0.625,0,6,8,10,12,14,18,"NA","NA","NA","NA","NA","NA",{"$f":"IF(SOT+SR!$AB$135<=F89,\"Y\",\"N\")","v":"Y"},{"$f":"2*SOT/(Menu!$P$38*D89)","v":0.35493827160493829},{"$f":"IF(OR(AA89=6,AA89=8),MATCH(AA89,M89:Y89),MATCH(AA89,M89:Y89)+1)","v":2},{"$f":"CHOOSE(AB89,$M89,$N89,$O89,$P89,$Q89,$R89,$S89,$T89,$U89,$V89,$W89,$X89,$Y89)","v":6},{"$f":"IF(AC89<=$AK$141,\"Y\",\"N\")","v":"Y"},{"$f":"SOT/($AK$141/2*D89)","v":1.5775034293552814},{"$f":"IF(AE89<=Menu!$P$38,\"Y\",\"N\")","v":"Y"},{"$f":"AND(Z89=\"Y\",AD89=\"Y\",AF89=\"Y\")","v":true},"F07",null,1,6,"Quarter turn \"sandwich\" non declutching worm gear operator for manual override of spring return pneumatic actuators in the anti-fail direction (rotation in fail direction provided by spring return pneumatic)."]
[2,"DT7SRD",48,12.96,{"$f":"G90*D90*80/2","v":5184.0000000000009},7000,10,80,108.02469135802467,18,60.013717421124824,0.625,0,6,8,10,12,14,18,"NA","NA","NA","NA","NA","NA",{"$f":"IF(SOT+SR!$AB$135<=F90,\"Y\",\"N\")","v":"Y"},{"$f":"2*SOT/(Menu!$P$38*D90)","v":0.22183641975308638},{"$f":"IF(OR(AA90=10,AA90=12,AA90=14,AA90=16,AA90=18,AA90=20,AA90=24,AA90=28),MATCH(AA90,M90:Y90),MATCH(AA90,M90:Y90)+1)","v":2},6,"Y",0.98593964334705064,{"$f":"IF(AE90<=Menu!$P$38,\"Y\",\"N\")","v":"Y"},true,"F10",null,2,8]
[3,"DT12SRD",57,13.68,{"$f":"G91*D91*77/2","v":9480.24},12000,18,77,97.465886939571149,36,48.732943469785575,1,0,6,8,10,12,14,18,20,24,30,36,"NA","NA",{"$f":"IF(SOT+SR!$AB$135<=F91,\"Y\",\"N\")","v":"Y"},{"$f":"2*SOT/(Menu!$P$38*D91)","v":0.21016081871345027},{"$f":"IF(OR(AA91=10,AA91=12,AA91=14,AA91=16,AA91=18,AA91=20,AA91=24,AA91=28),MATCH(AA91,M91:Y91),MATCH(AA91,M91:Y91)+1)","v":2},6,"Y",0.93404808317089016,{"$f":"IF(AE91<=Menu!$P$38,\"Y\",\"N\")","v":"Y"},true,"F12",null,3,10]
[4,"DT21SRD",60,13.2,{"$f":"G92*D92*80/2","v":12671.999999999998},21000,24,80,132.57575757575759,36,88.383838383838381,1,0,6,8,10,12,14,18,20,24,30,36,"NA","NA",{"$f":"IF(SOT+SR!$AB$135<=F92,\"Y\",\"N\")","v":"Y"},{"$f":"2*SOT/(Menu!$P$38*D92)","v":0.2178030303030303},{"$f":"IF(OR(AA92=10,AA92=12,AA92=14,AA92=16,AA92=18,AA92=20,AA92=24,AA92=28,AA92=30,AA92=32),MATCH(AA92,M92:Y92),MATCH(AA92,M92:Y92)+1)","v":2},6,"Y",0.96801346801346799,{"$f":"IF(AE92<=Menu!$P$38,\"Y\",\"N\")","v":"Y"},true,"F14",null,4,12]
[5,"DT36SRD",53,13.25,{"$f":"G93*D93*80/2","v":19080},36000,36,80,150.9433962264151,36,150.9433962264151,1,0,6,8,10,12,14,18,20,24,30,36,"NA","NA",{"$f":"IF(SOT+SR!$AB$135<=F93,\"Y\",\"N\")","v":"Y"},{"$f":"2*SOT/(Menu!$P$38*D93)","v":0.21698113207547171},{"$f":"IF(OR(AA93=10,AA93=12,AA93=14,AA93=16,AA93=18,AA93=20,AA93=24,AA93=28,AA93=30,AA93=32,AA93=36),MATCH(AA93,M93:Y93),MATCH(AA93,M93:Y93)+1)","v":2},6,"Y",0.96436058700209648,{"$f":"IF(AE93<=Menu!$P$38,\"Y\",\"N\")","v":"Y"},true,"F16",null,5,14]
[6,"DT50SRD",212,34.450000000000003,{"$f":"G94*D94*80/2","v":49608},50000,36,80,80.632156103854214,36,80.632156103854214,1,0,6,8,10,12,14,18,20,24,30,36,"NA","NA",{"$f":"IF(SOT+SR!$AB$135<=F94,\"Y\",\"N\")","v":"Y"},{"$f":"2*SOT/(Menu!$P$38*D94)","v":8.3454281567489116E-2},{"$f":"IF(OR(AA94=10,AA94=12,AA94=14,AA94=16),MATCH(AA94,M94:Y94),MATCH(AA94,M94:Y94)+1)","v":2},6,"Y",0.37090791807772938,{"$f":"IF(AE94<=Menu!$P$38,\"Y\",\"N\")","v":"Y"},true,"F16",null,6,18]
[7,"DT54SRD",318,51.68,{"$f":"G95*D95*80/2","v":62016},63000,30,80,81.269349845201234,36,67.724458204334368,1,0,6,8,10,12,14,18,20,24,30,36,"NA","NA",{"$f":"IF(SOT+SR!$AB$135<=F95,\"Y\",\"N\")","v":"Y"},{"$f":"2*SOT/(Menu!$P$38*D95)","v":5.5630804953560375E-2},{"$f":"IF(OR(AA95=14,AA95=16,AA95=18,AA95=20,AA95=24,AA95=28,AA95=30,AA95=32,AA95=36),MATCH(AA95,M95:Y95),MATCH(AA95,M95:Y95)+1)","v":2},6,"Y",0.24724802201582388,{"$f":"IF(AE95<=Menu!$P$38,\"Y\",\"N\")","v":"Y"},true,"F16",null,7,20]
[8,"Consult Eng.",99999,99999,99999,999999,99999,2.000020000200002E-5,2.0000380005600073E-4,99999,2.0000380005600073E-4,99999,0,99,99,99,99,99,99,99,99,99,99,99,"NA",{"$f":"IF(SOT+SR!$AB$135<=F96,\"Y\",\"N\")","v":"Y"},{"$f":"2*SOT/(Menu!$P$38*D96)","v":2.875028750287503E-5},{"$f":"MATCH(AA96,M96:Y96)","v":1},0,"Y",1.2777905556833347E-4,{"$f":"IF(AE96<=Menu!$P$38,\"Y\",\"N\")","v":"Y"},true,null,null,8,24]
[null,null,null,null,null,null,null,null,null,null,null,null,null,null,null,null,null,null,null,null,null,null,null,null,null,null,null,null,null,null,null,null,null,null,null,9,30]
[null,null,null,null,null,null,null,null,null,null,null,null,null,null,null,null,null,null,null,null,null,null,null,null,null,null,null,null,null,null,null,null,null,null,null,10,36]
[]
[]
[]
[null,null,null,null,null,null,null,null,null,null,null,null,null,null,null,null,null,null,null,null,null,null,null,null,null,null,null,null,null,null,null,null,null,null,null,7]
["Gear_Op_MG",null,null,null,null,null,"Gear_Op_MG",null,null,null,null,null,null,null,null,null,null,null,null,null,null,null,null,null,null,null,null,null,null,null,null,null,null,null,null,7]
["MasterGear Gear Operator Data Table (Table 13D)",null,null,null,null,null,"A107:AJ114"]
[null,null,null,null,null,null,"Std. Handwheel",null,null,"Largest HW",null,null,"Handwheel Diameters Available, In.",null,null,null,null,null,null,null,null,null,null,null,null,"Handwheel Dia.",null,null,null,null,"Handwheel Pull",null,"All Criteria Met",null,null,"MasterGear Max. HW Dia. Sel. Menu (Table 14D)"]
["Marwin No. (Relative Cost)","Master-\nGear\nNo.","Gear Ratio","Mech.\nAdvan-\ntage","*Std. Torque Output\nIn-lbf","Max Torque Output\nIn-lbf","Std.\nHW Dia.\nIn.","Tot. HW\nPull @ Std Torque\nLbf","Tot. HW\nPull @ Max Torq.\nLbf","Largest HW Dia.\nIn.","Tot. HW Pull @ Max Torq.\nLbf","HW Shaft Dia",1,2,3,4,5,6,7,8,9,10,11,12,null,"Va. Torq. <= Oper. Max. Output Torque","Calc. D. for User Max Pull,\nIn.","Index No. of Next Largest Avail. HW","Next Larg-\nest Avail. HW D.\nIn.","<= Max Allow. Dia","Tot. Pull, Lbf","<= Max Pull",null,null,null,7,"HW Dia","MasterGear GO Description:"]
[1,"M05",40,9.3000000000000007,{"$f":"G107*D107*80/2","v":2232},1100,6,{"$f":"E107/(G107/2*D107)","v":80},{"$f":"F107/(G107/2*D107)","v":39.426523297491038},9,{"$f":"F107/(D107*J107/2)","v":26.284348864994026},0.47099999999999997,0,6,9,"NA","NA","NA","NA","NA","NA","NA","NA","NA","NA",{"$f":"IF(F107>=SOT,\"Y\",\"N\")","v":"Y"},{"$f":"2*SOT/(Menu!$P$38*D107)","v":0.30913978494623656},{"$f":"IF(OR(AA107=6,AA107=8),MATCH(AA107,M107:Y107),MATCH(AA107,M107:Y107)+1)","v":2},{"$f":"CHOOSE(AB107,$M107,$N107,$O107,$P107,$Q107,$R107,$S107,$T107,$U107,$V107,$W107,$X107,$Y107)","v":6},{"$f":"IF(AC107<=$AK$141,\"Y\",\"N\")","v":"Y"},{"$f":"SOT/($AK$141/2*D107)","v":1.3739545997610514},{"$f":"IF(AE107<=Menu!$P$38,\"Y\",\"N\")","v":"Y"},{"$f":"AND(Z107=\"Y\",AD107=\"Y\",AF107=\"Y\")","v":true},null,null,1,6,"Quarter turn worm gear operator for manual valves."]
[2,"M07",40,11,2640,2200,6,80,66.666666666666671,9,44.444444444444443,0.47099999999999997,0,6,9,"NA","NA","NA","NA","NA","NA","NA","NA","NA","NA","Y",{"$f":"2*SOT/(Menu!$P$38*D108)","v":0.26136363636363635},{"$f":"IF(OR(AA108=10,AA108=12,AA108=14,AA108=16,AA108=18,AA108=20,AA108=24,AA108=28),MATCH(AA108,M108:Y108),MATCH(AA108,M108:Y108)+1)","v":2},6,"Y",1.1616161616161615,{"$f":"IF(AE108<=Menu!$P$38,\"Y\",\"N\")","v":"Y"},true,null,null,2,9]
[3,"M10",40,11,4400,4400,10,80,80,12,66.666666666666671,0.58850000000000002,0,6,10,12,"NA","NA","NA","NA","NA","NA","NA","NA","NA","Y",{"$f":"2*SOT/(Menu!$P$38*D109)","v":0.26136363636363635},{"$f":"IF(OR(AA109=10,AA109=12,AA109=14,AA109=16,AA109=18,AA109=20,AA109=24,AA109=28,AA109=30,AA109=32),MATCH(AA109,M109:Y109),MATCH(AA109,M109:Y109)+1)","v":2},6,"Y",1.1616161616161615,{"$f":"IF(AE109<=Menu!$P$38,\"Y\",\"N\")","v":"Y"},true,null,null,3,10]
[4,"M12",42,11.3,6328.0000000000009,8800,14,80,111.25158027812894,24,64.896755162241874,0.78549999999999998,0,10,12,14,18,24,"NA","NA","NA","NA","NA","NA","NA","Y",{"$f":"2*SOT/(Menu!$P$38*D110)","v":0.25442477876106195},{"$f":"IF(OR(AA110=10,AA110=12,AA110=14,AA110=16,AA110=18,AA110=20,AA110=24,AA110=28,AA110=30,AA110=32,AA110=36),MATCH(AA110,M110:Y110),MATCH(AA110,M110:Y110)+1)","v":2},10,"Y",1.1307767944936087,{"$f":"IF(AE110<=Menu!$P$38,\"Y\",\"N\")","v":"Y"},true,null,null,4,12]
[5,"M14",60,16.2,11663.999999999998,15840,18,80,108.64197530864199,24,81.481481481481495,0.78549999999999998,0,10,12,14,18,24,"NA","NA","NA","NA","NA","NA","NA","Y",{"$f":"2*SOT/(Menu!$P$38*D111)","v":0.17746913580246915},{"$f":"IF(OR(AA111=10,AA111=12,AA111=14,AA111=16),MATCH(AA111,M111:Y111),MATCH(AA111,M111:Y111)+1)","v":2},10,"Y",0.78875171467764071,{"$f":"IF(AE111<=Menu!$P$38,\"Y\",\"N\")","v":"Y"},true,null,null,5,14]
[6,"M15",68,20.5,19680,29920,24,80,121.6260162601626,36,81.084010840108405,1.179,0,18,24,30,36,"NA","NA","NA","NA","NA","NA","NA","NA","Y",{"$f":"2*SOT/(Menu!$P$38*D112)","v":0.1402439024390244},{"$f":"IF(OR(AA112=14,AA112=16,AA112=18,AA112=20,AA112=24,AA112=28,AA112=30,AA112=32,AA112=36),MATCH(AA112,M112:Y112),MATCH(AA112,M112:Y112)+1)","v":2},18,"Y",0.62330623306233057,{"$f":"IF(AE112<=Menu!$P$38,\"Y\",\"N\")","v":"Y"},true,null,null,6,18]
[7,"M16",88,26.5,31800,39600,30,80,99.622641509433961,36,83.018867924528308,1.179,0,18,24,30,36,"NA","NA","NA","NA","NA","NA","NA","NA","Y",{"$f":"2*SOT/(Menu!$P$38*D113)","v":0.10849056603773585},{"$f":"IF(OR(AA113=14,AA113=16,AA113=18,AA113=20,AA113=24,AA113=28,AA113=30,AA113=32),MATCH(AA113,M113:Y113),MATCH(AA113,M113:Y113)+1)","v":2},18,"Y",0.48218029350104824,{"$f":"IF(AE113<=Menu!$P$38,\"Y\",\"N\")","v":"Y"},true,null,null,7,24]
[9,"Consult Eng.",99999,99999,99999,999999,99999,2.000020000200002E-5,2.0000380005600073E-4,99999,2.0000380005600073E-4,99999,0,99,99,99,99,99,99,99,99,99,99,99,"NA","Y",{"$f":"2*SOT/(Menu!$P$38*D114)","v":2.875028750287503E-5},{"$f":"MATCH(AA114,M114:Y114)","v":1},0,"Y",1.2777905556833347E-4,{"$f":"IF(AE114<=Menu!$P$38,\"Y\",\"N\")","v":"Y"},true,null,null,8,30]
[null,{"$f":"NA()","v":{"$error":"#N/A"}},{"$f":"NA()","v":{"$error":"#N/A"}},{"$f":"NA()","v":{"$error":"#N/A"}},{"$f":"NA()","v":{"$error":"#N/A"}},{"$f":"NA()","v":{"$error":"#N/A"}},{"$f":"NA()","v":{"$error":"#N/A"}},{"$f":"E115/(G115/2*D115)","v":{"$error":"#N/A"}},{"$f":"F115/(G115/2*D115)","v":{"$error":"#N/A"}},{"$f":"NA()","v":{"$error":"#N/A"}},{"$f":"F115/(D115*J115/2)","v":{"$error":"#N/A"}},{"$f":"NA()","v":{"$error":"#N/A"}},0,"NA","NA","NA","NA","NA","NA","NA","NA","NA","NA","NA","NA",{"$f":"IF(F115>=SOT,\"Y\",\"N\")","v":{"$error":"#N/A"}},{"$f":"2*SOT/(Menu!$P$38*D115)","v":{"$error":"#N/A"}},{"$f":"IF(OR(AA115=14,AA115=16,AA115=18,AA115=20,AA115=24,AA115=28,AA115=30,AA115=32,AA115=36),MATCH(AA115,M115:Y115),MATCH(AA115,M115:Y115)+1)","v":{"$error":"#N/A"}},{"$f":"CHOOSE(AB115,$M115,$N115,$O115,$P115,$Q115,$R115,$S115,$T115,$U115,$V115,$W115,$X115,$Y115)","v":{"$error":"#N/A"}},{"$f":"IF(AC115<=$AK$141,\"Y\",\"N\")","v":{"$error":"#N/A"}},{"$f":"SOT/($AK$141/2*D115)","v":{"$error":"#N/A"}},{"$f":"IF(AE115<=Menu!$P$38,\"Y\",\"N\")","v":{"$error":"#N/A"}},{"$f":"AND(Z115=\"Y\",AD115=\"Y\",AF115=\"Y\")","v":{"$error":"#N/A"}},null,null,9,36]
[null,{"$f":"NA()","v":{"$error":"#N/A"}},{"$f":"NA()","v":{"$error":"#N/A"}},{"$f":"NA()","v":{"$error":"#N/A"}},{"$f":"NA()","v":{"$error":"#N/A"}},{"$f":"NA()","v":{"$error":"#N/A"}},{"$f":"NA()","v":{"$error":"#N/A"}},{"$error":"#N/A"},{"$error":"#N/A"},{"$f":"NA()","v":{"$error":"#N/A"}},{"$error":"#N/A"},{"$f":"NA()","v":{"$error":"#N/A"}},0,"NA","NA","NA","NA","NA","NA","NA","NA","NA","NA","NA","NA",{"$error":"#N/A"},{"$f":"2*SOT/(Menu!$P$38*D116)","v":{"$error":"#N/A"}},{"$f":"IF(OR(AA116=14,AA116=16,AA116=18,AA116=20,AA116=24,AA116=28,AA116=30,AA116=32),MATCH(AA116,M116:Y116),MATCH(AA116,M116:Y116)+1)","v":{"$error":"#N/A"}},{"$error":"#N/A"},{"$error":"#N/A"},{"$error":"#N/A"},{"$f":"IF(AE116<=Menu!$P$38,\"Y\",\"N\")","v":{"$error":"#N/A"}},{"$error":"#N/A"},null,null,10,"--"]
[null,{"$f":"NA()","v":{"$error":"#N/A"}},{"$f":"NA()","v":{"$error":"#N/A"}},{"$f":"NA()","v":{"$error":"#N/A"}},{"$f":"NA()","v":{"$error":"#N/A"}},{"$f":"NA()","v":{"$error":"#N/A"}},{"$f":"NA()","v":{"$error":"#N/A"}},{"$error":"#N/A"},{"$error":"#N/A"},{"$f":"NA()","v":{"$error":"#N/A"}},{"$error":"#N/A"},{"$f":"NA()","v":{"$error":"#N/A"}},0,"NA","NA","NA","NA","NA","NA","NA","NA","NA","NA","NA","NA",{"$error":"#N/A"},{"$f":"2*SOT/(Menu!$P$38*D117)","v":{"$error":"#N/A"}},{"$f":"IF(OR(AA117=14,AA117=16,AA117=18,AA117=20,AA117=24,AA117=28,AA117=30,AA117=32),MATCH(AA117,M117:Y117),MATCH(AA117,M117:Y117)+1)","v":{"$error":"#N/A"}},{"$error":"#N/A"},{"$error":"#N/A"},{"$error":"#N/A"},{"$f":"IF(AE117<=Menu!$P$38,\"Y\",\"N\")","v":{"$error":"#N/A"}},{"$error":"#N/A"},null,null,11,"--"]
[null,{"$f":"NA()","v":{"$error":"#N/A"}},{"$f":"NA()","v":{"$error":"#N/A"}},{"$f":"NA()","v":{"$error":"#N/A"}},{"$f":"NA()","v":{"$error":"#N/A"}},{"$f":"NA()","v":{"$error":"#N/A"}},{"$f":"NA()","v":{"$error":"#N/A"}},{"$error":"#N/A"},{"$error":"#N/A"},{"$f":"NA()","v":{"$error":"#N/A"}},{"$error":"#N/A"},{"$f":"NA()","v":{"$error":"#N/A"}},0,"NA","NA","NA","NA","NA","NA","NA","NA","NA","NA","NA","NA",{"$error":"#N/A"},{"$f":"2*SOT/(Menu!$P$38*D118)","v":{"$error":"#N/A"}},{"$f":"IF(OR(AA118=14,AA118=16,AA118=18,AA118=20,AA118=24,AA118=28,AA118=30,AA118=32),MATCH(AA118,M118:Y118),MATCH(AA118,M118:Y118)+1)","v":{"$error":"#N/A"}},{"$error":"#N/A"},{"$error":"#N/A"},{"$error":"#N/A"},{"$f":"IF(AE118<=Menu!$P$38,\"Y\",\"N\")","v":{"$error":"#N/A"}},{"$error":"#N/A"},null,null,12,"--"]
["MasterGear Controls",null,null,null,null,null,null,null,null,null,null,null,null,null,null,null,null,null,null,null,null,null,null,null,null,null,null,null,null,null,null,null,null,null,null,13,"--"]
["Ref. MasterGear dwg. M05/DB1 A 5/13/02, M07/DB1 A 2/13/02, M10 A 5/13/02, M12 A 5/13/02, M14 A 5/13/02, M15 A 5/13/02, M16 A 5/13/02"]
["*Std. torque output is torque output for 80 lb HW pull with Std. Dia. HW."]
[]
[]
[]
["Gear Operator Selection Table (Table 13E)",null,null,null,null,{"$f":"CHOOSE($AP$14, G42, G70, G85, G2,G23,G103)","v":"Gear_Op_DT"}]
[null,null,null,null,null,null,"Std. Handwheel",null,null,"Largest HW",null,null,"Handwheel Diameters Available, In.",null,null,null,null,null,null,null,null,null,null,null,null,"Handwheel Dia.",null,null,null,null,"Handwheel Pull",null,null,"Mount",null,"Max. HW Dia. Sel. Menu (Table 14E)"]
["Marwin No. (Relative Cost)","Gear Op Mfgr. No.","Gear Ratio","Mech.\nAdvan-\ntage","*Std. Torque Output\nIn-lbf","Max Torque Output\nIn-lbf","Std.\nHW Dia.\nIn.","Tot. HW\nPull @ Std Torque\nLbf","Tot. HW\nPull @ Max Torq.\nLbf","Largest HW Dia.\nIn.","Tot. HW Pull @ Max Torq.\nLbf","HW Shaft Dia",1,2,3,4,5,6,7,8,9,10,11,12,null,"Va. Torq. <= Oper. Max. Output Torque","Calc. D. for User Max Pull,\nIn.","Index No. of Next Largest Avail. HW","Next Larg-\nest Avail. HW D.\nIn.","<= Max Allow. Dia","Tot. Pull, Lbf","<= Max Pull",null,null,null,null,"HW Dia","Gear Operator Description"]
[{"$f":"CHOOSE($AP$14, A46, A74, A89, A6, A27, A107)","v":1},"DT3",30,8.1,3887.9999999999995,4500,12,80,92.592592592592609,18,61.728395061728399,0.625,0,6,8,10,12,14,18,"NA","NA","NA","NA","NA","NA","Y",0.35493827160493829,2,6,"Y",1.5775034293552814,"Y",null,{"$f":"CHOOSE($AP$14, AH46, AH74, AH89, AH6, AH27, AH107)","v":"0.38-16 on 3.25 BC"},null,1,{"$f":"CHOOSE($AP$14,AK46,AK74,AK89,AK6,AK27,AK107)","v":6},{"$f":"CHOOSE($AP$14, AL46, AL74, AL89, AL6, AL27, AL107)","v":"Quarter turn worm gear operator for manual valves."}]
[null,null,null,null,null,null,null,null,null,null,null,null,null,null,null,null,null,null,null,null,null,null,null,null,null,null,null,null,null,null,null,null,null,null,null,2,8]
[null,null,null,null,null,null,null,null,null,null,null,null,null,null,null,null,null,null,null,null,null,null,null,null,null,null,null,null,null,null,null,null,null,null,null,3,10]
[null,null,null,null,null,null,null,null,null,null,null,null,null,null,null,null,null,null,null,null,null,null,null,null,null,null,null,null,null,null,null,null,null,null,null,4,12]
[null,null,null,null,null,null,null,null,null,null,null,null,null,null,null,null,null,null,null,null,null,null,null,null,null,null,null,null,null,null,null,null,null,null,null,5,14]
[null,null,null,null,null,null,null,null,null,null,null,null,null,null,null,null,null,null,null,null,null,null,null,null,null,null,null,null,null,null,null,null,null,null,null,6,18]
[null,null,null,null,null,null,null,null,null,null,null,null,null,null,null,null,null,null,null,null,null,null,null,null,null,null,null,null,null,null,null,null,null,null,null,7,20]
[null,null,null,null,null,null,null,null,null,null,null,null,null,null,null,null,null,null,null,null,null,null,null,null,null,null,null,null,null,null,null,null,null,null,null,8,24]
[null,null,null,null,null,null,null,null,null,null,null,null,null,null,null,null,null,null,null,null,null,null,null,null,null,null,null,null,null,null,null,null,null,null,null,9,30]
[null,null,null,null,null,null,null,null,null,null,null,null,null,null,null,null,null,null,null,null,null,null,null,null,null,null,null,null,null,null,null,null,null,null,null,10,36]
[null,null,null,null,null,null,null,null,null,null,null,null,null,null,null,null,null,null,null,null,null,null,null,null,null,null,null,null,null,null,null,null,null,null,null,11,0]
[null,null,null,null,null,null,null,null,null,null,null,null,null,null,null,null,null,null,null,null,null,null,null,null,null,null,null,null,null,null,null,null,null,null,null,7,0]
[null,null,null,null,null,null,null,null,null,null,null,null,null,null,null,null,null,null,null,null,null,null,null,null,null,null,null,null,null,null,null,null,null,null,null,13,0]
[null,null,null,null,null,null,null,null,null,null,null,null,null,null,null,null,null,null,null,null,null,null,null,null,null,null,null,null,null,null,null,null,null,null,"Max. Allow. HW Dia, in.:",6,{"$f":"VLOOKUP($AJ$141,$AJ$128:$AK$140,2, FALSE)","v":18}]
["Max. HW Dia. Sel. Menu (Table 14E) to Right ------->"]

{"sheet":"600","index":8,"n_rows":50,"n_cols":12,"rows_kept":50,"cut":false,"hidden":true,"merged":[[3,9,3,11],[22,9,22,11],[36,9,36,11],[36,1,36,4],[3,1,3,4],[22,1,22,4],[36,5,36,8],[3,5,3,8],[22,5,22,8]]}
[]
[]
["DM600F Series Full Port Direct Mount",null,null,null,"_DM600F","Press =",{"$f":"Press","v":1500},"psi"]
[null,"Torque (Break), lbf-in.",null,null,null,"Max. Seat Pressure",null,null,null,"Mounting"]
[null,"Teflon","RPTFE","Delrin","PEEK","T","R","D","P","Mount","Blt Ptrn","Sq"]
["Size           Col.",2,3,4,5,6,7,8,9,10,11,12]
["0.25",10,"--","--","--","NA","--","--","--","Direct","F03",9]
["0.38",10,"--","--","--","NA","--","--","--","Direct","F03",9]
["0.50",11,"--","--","--","NA","--","--","--","Direct","F03",9]
["0.75",{"$f":" 0.0091*Press + 10.01","v":23.66},"--","--","--",600,"--","--","--","Direct","F03",9]
["1.00",{"$f":"0.0209*Press + 15.14","v":46.489999999999995},"--","--","--",600,"--","--","--","Direct","F03",9]
["1.25",{"$f":" 0.0701*Press + 27.312","v":132.46199999999999},"--","--","--",600,"--","--","--","Direct","F03",9]
["1.50",{"$f":" 0.00004*Press^2+0.1092*Press +41.311","v":295.11099999999999},"--","--","--",600,"--","--","--","Direct","F05",11]
["2.00",{"$f":" 0.2117*Press + 75.658","v":393.20800000000003},"--","--","--",600,"--","--","--","Direct","F05",11]
["2.50",{"$f":" -0.0002*Press^2 + 0.3859*Press + 153.68","v":282.53000000000003},"--","--","--",600,"--","--","--","Direct","F07",14]
["3.00",{"$f":" -0.0004*Press^2 + 0.5654*Press + 224.22","v":172.32000000000002},"--","--","--",600,"--","--","--","Direct","F07",14]
["4.00",{"$f":" -0.0002*Press^2 + 0.7116*Press + 290.35","v":907.75000000000011},"--","--","--",600,"--","--","--","Direct","F07",17]
["--","--","--","--","--","--","--","--","--","--","--","--"]
["Valpres 250N"]
["Reference 1/15/02 e-mail & 1/15/02 Fax, Claudio Cancarini, Torques for Valpres Types 6121, 6123, and 250N, Istruzione I-010.3/13, Momento Torcente Valvole, OTTONE sr. 2500 (e derivati 250N, 2530, 253N)"]
[]
["666R Series Reduced Port",null,null,null,"_666R"]
[null,"Torque (Break), lbf-in.",null,null,null,"Max. Seat Pressure",null,null,null,"Mounting"]
[null,"Teflon","RPTFE","Delrin","PEEK","T","R","D","P","Mount","Blt Ptrn","Sq"]
["Size           Col.",2,3,4,5,6,7,8,9,10,11,12]
["0.50",18,"--","--","--","NA","--","--","--","None","--","--"]
["0.75",23,"--","--","--","NA","--","--","--","None","--","--"]
["1.00",62,"--","--","--","NA","--","--","--","None","--","--"]
["1.25",89,"--","--","--","NA","--","--","--","None","--","--"]
["1.50",133,"--","--","--","NA","--","--","--","None","--","--"]
["2.00",178,"--","--","--","NA","--","--","--","None","--","--"]
["--","--","--","--","--","--","--","--","--","-","--","--"]
["Valpres 6123"]
["Reference 1/15/02 e-mail & 1/15/02 Fax, Claudio Cancarini, Torques for Valpres Types 6121, 6123, and 250N"]
[]
["666F Series Full Port",null,null,null,"_666F"]
[null,"Torque (Break), lbf-in.",null,null,null,"Max. Seat Pressure",null,null,null,"Mounting"]
[null,"Teflon","RPTFE","Delrin","PEEK","T","R","D","P","Mount","Blt Ptrn","Sq"]
["Size           Col.",2,3,4,5,6,7,8,9,10,11,12]
["0.25",18,"--","--","--","NA","--","--","--","None","--","--"]
["0.38",18,"--","--","--","NA","--","--","--","None","--","--"]
["0.50",23,"--","--","--","NA","--","--","--","None","--","--"]
["0.75",62,"--","--","--","NA","--","--","--","None","--","--"]
["1.00",89,"--","--","--","NA","--","--","--","None","--","--"]
["1.25",133,"--","--","--","NA","--","--","--","None","--","--"]
["1.50",178,"--","--","--","NA","--","--","--","None","--","--"]
["2.00",222,"--","--","--","NA","--","--","--","None","--","--"]
["--","--","--","--","--","--","--","--","--","-","--","--"]
["Valpres 6121"]
["Reference 1/15/02 e-mail & 1/15/02 Fax, Claudio Cancarini, Torques for Valpres Types 6121, 6123, and 250N, Istruzione I-010.3/13 Momenti Torcenti Valvole OTTONE sr.171N"]

{"sheet":"2K","index":9,"n_rows":52,"n_cols":17,"rows_kept":52,"cut":false,"hidden":true,"merged":[[3,9,3,11],[18,9,18,11],[38,9,38,11],[18,1,18,4],[3,1,3,4],[38,1,38,4],[3,5,3,8],[18,5,18,8],[38,5,38,8]]}
[]
[]
["2000R-150 Series Reduced Port",null,null,null,"_2000R_150",{"$f":"Press","v":1500},"psi"]
[null,"Torque (Break), lbf-in.",null,null,null,"Max. Seat Pressure",null,null,null,"Mounting"]
[null,"Teflon","RPTFE","CRPTFE","UHMW-PE","T","R","S","U","Mount","Blt Ptrn","Sq",null,null,"UHMW-PE",null,"PTFE"]
["Size           Col.",2,3,4,5,6,7,8,9,10,11,12,null,null,"1.15 RPTFE",null,"0.9 RPTFE"]
["1.00",{"$f":"0.9*$C7","v":99},{"$f":"IF(Press<=100,90,110)","v":110},{"$f":"1.15*$C7","v":126.49999999999999},126.49999999999999,285,285,285,285,"Bckt & Cplgr","F04",6.3,null,null,{"$f":"1.15*$C7","v":126.49999999999999},null,{"$f":"0.9*$C7","v":99}]
["1.50",{"$f":"0.9*$C8","v":198},{"$f":"IF(Press<=100,180,220)","v":220},252.99999999999997,252.99999999999997,285,285,285,285,"Bckt & Cplgr","F05",8,null,null,{"$f":"1.15*$C8","v":252.99999999999997},null,{"$f":"0.9*$C8","v":198}]
["2.00",{"$f":"0.9*$C9","v":342},{"$f":"IF(Press<=100,300,380)","v":380},436.99999999999994,436.99999999999994,285,285,285,285,"Bckt & Cplgr","F05",9.9600000000000009,null,null,{"$f":"1.15*$C9","v":436.99999999999994},null,{"$f":"0.9*$C9","v":342}]
["3.00",{"$f":"0.9*$C10","v":810},{"$f":"IF(Press<=100,700,900)","v":900},1035,1035,285,285,285,285,"Bckt & Cplgr","F07",17,null,null,{"$f":"1.15*$C10","v":1035},null,{"$f":"0.9*$C10","v":810}]
["4.00",{"$f":"0.9*$C11","v":1440},{"$f":"IF(Press<=100,1100,1600)","v":1600},1839.9999999999998,1839.9999999999998,285,285,285,285,"Bckt & Cplgr","F07",17,null,null,{"$f":"1.15*$C11","v":1839.9999999999998},null,{"$f":"0.9*$C11","v":1440}]
["--","--","--","--","--","--","--","--","--","--"]
["Die Erste ED-111RF150"]
["2000R-150 torques agree w/ Bulletin 2000R-0100 G",null,null,null,null,"1\" 65 in-lb per Joy Su e-mail 3/9/06  Use 90 <= 100 psi, 100 > 100 psi"]
["Yellow shaded cells contain eqn. and / or logic statement.",null,null,null,null,"1.5\" 110 in-lb per Joy Su e-mail 3/6/06  Use 225 <= 100 psi, 250 > 100 psi"]
[]
[]
["2000F-150 Series Full Port",null,null,null,"_2000F_150","Press =",{"$f":"Press","v":1500},"psi"]
[null,"Torque (Break), lbf-in.",null,null,null,"Max. Seat Pressure",null,null,null,"Mounting"]
[null,"Teflon","RPTFE","CRPTFE","UHMW-PE","T","R","S","U","Mount","Blt Ptrn","Sq",null,null,"UHMW-PE",null,"PTFE"]
["Size           Col.",2,3,4,5,6,7,8,9,10,11,12,null,null,"1.15 RPTFE",null,"0.9 RPTFE"]
["0.50",{"$f":"0.9*$C22","v":79.2},88,{"$f":"1.15*$C22","v":101.19999999999999},{"$f":"1.15*$C22","v":101.19999999999999},"NA","NA","NA","NA","Bckt & Cplgr","F04",6.3,null,null,{"$f":"1.15*$C22","v":101.19999999999999},null,{"$f":"0.9*$C22","v":79.2}]
["0.75",{"$f":"0.9*$C23","v":95.4},106,{"$f":"1.15*$C23","v":121.89999999999999},{"$f":"1.15*$C23","v":121.89999999999999},"NA","NA","NA","NA","Bckt & Cplgr","F04",6.3,null,null,{"$f":"1.15*$C23","v":121.89999999999999},null,{"$f":"0.9*$C23","v":95.4}]
["1.00",118.8,132,151.79999999999998,151.79999999999998,"NA","NA","NA","NA","Bckt & Cplgr","F05",8,null,null,151.79999999999998,null,118.8]
["1.25",230.4,256,294.39999999999998,294.39999999999998,"NA","NA","NA","NA","--","--","--",null,null,294.39999999999998,null,230.4]
["1.50",318.60000000000002,354,407.09999999999997,407.09999999999997,"NA","NA","NA","NA","Bckt & Cplgr","F07",9.5,null,null,407.09999999999997,null,318.60000000000002]
["2.00",381.6,424,487.59999999999997,487.59999999999997,"NA","NA","NA","NA","Bckt & Cplgr","F07",9.5,null,null,487.59999999999997,null,381.6]
["2.50",526.5,585,672.75,672.75,"NA","NA","NA","NA","Bckt & Cplgr","F07",17,null,null,672.75,null,526.5]
["3.00",883.80000000000007,982,1129.3,1129.3,"NA","NA","NA","NA","Bckt & Cplgr","F10",17,null,null,1129.3,null,883.80000000000007]
["4.00",1115.1000000000001,1239,1424.85,1424.85,"NA","NA","NA","NA","Bckt & Cplgr","F10",17,null,null,1424.85,null,1115.1000000000001]
["6.00",3150,3500,4024.9999999999995,4024.9999999999995,"NA","NA","NA","NA","Bckt & Cplgr","F10",25,null,null,4024.9999999999995,null,3150]
["--","--","--","--","--","--","--","--","--","--","--","--"]
["Die Erste ED-211FF-150 (0.5\"-4.0\"); DE-23 (6.0\")"]
["0.5-4.0 Torque values supplied by Die Erste to Chuck Bechtel for RPTFE 4/11/01 in response to 4/10/01 request."]
["6.0 Torque value added 8/4/01."]
[]
[]
["2000F-300 Series Full Port",null,null,null,"_2000F_300","Press =",{"$f":"Press","v":1500},"psi"]
[null,"Torque (Break), lbf-in.",null,null,null,"Max. Seat Pressure",null,null,null,"Mounting"]
[null,"Teflon","RPTFE","CRPTFE","UHMW-PE","T","R","S","U","Mount","Blt Ptrn","Sq",null,null,"UHMW-PE"]
["Size           Col.",2,3,4,5,6,7,8,9,10,11,12,null,null,"1.3 PTFE"]
["1.00",{"$f":" 0.0000691*Press + 0.00296*Press + 110.092","v":114.63565},{"$f":"1.2*B42","v":137.56278},{"$f":"1.3*$B42","v":149.02634499999999},{"$f":"1.3*$B42","v":149.02634499999999},740,740,740,740,"Bckt & Cplgr","F05",8,null,null,{"$f":"1.3*$B42","v":149.02634499999999}]
["1.50",{"$f":"0.000147*Press^2-0.0209*Press+133.5","v":432.9},519.4799999999999,{"$f":"1.3*$B43","v":562.77},{"$f":"1.3*$B43","v":562.77},740,740,740,740,"Bckt & Cplgr","F07",9.5,null,null,{"$f":"1.3*$B43","v":562.77}]
["2.00",{"$f":"0.000383*Press^2-0.0997*Press+183.2","v":895.40000000000009},1074.48,1164.0200000000002,1164.0200000000002,740,740,740,740,"Bckt & Cplgr","F07",9.5,null,null,1164.0200000000002]
["2.50",{"$f":"0.000287*Press^2+0.158*Press+302.415","v":1185.165},1422.1979999999999,1540.7145,1540.7145,740,740,740,740,"Bckt & Cplgr","F10",17,null,null,1540.7145]
["3.00",{"$f":"-0.000131*Press^2+0.939*Press+332.2","v":1445.95},1735.14,1879.7350000000001,1879.7350000000001,740,740,740,740,"Bckt & Cplgr","F10",17,null,null,1879.7350000000001]
["4.00",{"$f":"-0.00000258*Press^3+0.00408*Press^2+0.468*Press+558.6","v":1733.1},2079.7199999999998,2253.0299999999997,2253.0299999999997,740,740,740,740,"Bckt & Cplgr","F10",17,null,null,2253.0299999999997]
["6.00",{"$f":"IF(Press<=400,0.0000385*Press^3-0.0105*Press^2+1.223*Press+1483.7,-0.0126*Press^2+19.83*Press-3162.4)","v":-1767.4000000000037},-2120.8800000000042,-2297.6200000000049,-2297.6200000000049,740,740,740,740,"Bckt & Cplgr","F12",23,null,null,-2297.6200000000049]
["--","--","--","--","--","--","--","--","--","--","--","--"]
["Taiwan Valve 90S"]
["Torque values changed from TVC published literature to TVC torque sheet by han_wen of TVC dated 2/6/2004 and sent 7/7/05  JJH  6/9/06"]
["Yellow shaded cells contain eqn. and / or logic statement."]

{"sheet":"3K 10K","index":10,"n_rows":106,"n_cols":22,"rows_kept":106,"cut":false,"hidden":true,"merged":[[3,15,3,17],[23,15,23,17],[47,15,47,17],[90,1,90,7],[71,1,71,7],[90,8,90,14],[90,16,90,17],[71,16,71,17],[71,8,71,14],[3,1,3,7],[23,1,23,7],[47,1,47,7],[3,8,3,14],[47,8,47,14],[23,8,23,14]]}
["Press =",{"$f":"Press","v":1500}]
[]
["3000R Series Reduced Port",null,null,null,"_3000R",null,null,null,"Press =",{"$f":"Press","v":1500},"psi"]
[null,"Torque, lbf-in.",null,null,null,null,null,null,"Max. Seat Pressure",null,null,null,null,null,null,"Mounting"]
[null,"Teflon","RPTFE","CRPTFE","UHMW-PE","Delrin","PEEK","CPEEK","T","R","S","U","D","P","CP","Mount","Blt Ptrn","Sq",null,"UHMW_PE"]
["Size           Col.",2,3,4,5,6,7,8,9,10,11,12,13,14,15,10,11,12,null,"1.5 PTFE"]
["--"]
["--"]
["0.50",72,72,72,{"$f":"1.5*$B9","v":108},{"$f":"0.0107*Press + 84","v":100.05},{"$f":"0.5*(0.02*Press + 240)","v":135},{"$f":"1.25*G9","v":168.75},"NA","NA","NA","NA",4000,4000,4000,"Bckt & Cplgr","F03",5.44,null,{"$f":"1.5*$B9","v":108}]
["0.75",72,96,96,{"$f":"1.5*$B10","v":108},{"$f":"0.0107*Press + 108","v":124.05},{"$f":"0.5*(0.03*Press + 360)","v":202.5},{"$f":"1.25*G10","v":253.125},"NA","NA","NA","NA",4000,4000,4000,"Bckt & Cplgr","F03",5.44,null,{"$f":"1.5*$B10","v":108}]
["1.00",108,120,120,162,{"$f":"0.0133*Press + 160","v":179.95},{"$f":"0.5*(0.08*Press + 720)","v":420},525,"NA","NA","NA","NA",4000,3200,3200,"Bckt & Cplgr","F04",7.47,null,162]
["1.25",204,240,240,306,{"$f":"0.0267*Press + 200","v":240.05},{"$f":"0.5*(0.1*Press + 840)","v":495},618.75,"NA","NA","NA","NA",4000,3200,3200,"Bckt & Cplgr","F04",7.47,null,306]
["1.50",220,{"$f":"0.0636*Press + 260","v":355.4},{"$f":"0.0636*Press + 260","v":355.4},330,{"$f":"0.0444*Press + 250","v":316.60000000000002},{"$f":"0.5*(0.5*Press + 950)","v":850},1062.5,"NA",1500,2200,"NA",3200,3200,3200,"Bckt & Cplgr","F05",8.94,null,330]
["2.00",240,{"$f":"0.00006*Press^2 + 0.0457*Press + 289.58","v":493.13},{"$f":"0.00006*Press^2 + 0.0457*Press + 289.58","v":493.13},360,{"$f":"0.08*Press + 280","v":400},{"$f":"0.5*(0.72*Press + 1140)","v":1110},1387.5,"NA",1500,2200,"NA",3200,3200,3200,"Bckt & Cplgr","F05",8.94,null,360]
["2.50",432,{"$f":"0.34*Press + 780","v":1290},{"$f":"0.34*Press + 780","v":1290},648,{"$f":"NA()","v":{"$error":"#N/A"}},{"$f":"0.5*(1.173*Press + 1320)","v":1539.75},1924.6875,"NA",1000,2000,"NA","-",2400,2400,"Bckt & Cplgr","F05",13.71,null,648]
["3.00",{"$f":"0.8981*Press + 719.38","v":2066.5300000000002},{"$f":"-0.0006*Press^2 + 1.8923*Press + 1255.4","v":2743.8500000000004},{"$f":"-0.0006*Press^2 + 1.8923*Press + 1255.4","v":2743.8500000000004},{"$f":"-0.0003*Press^2+1.6217*Press+1051.6","v":2809.1499999999996},{"$f":"NA()","v":{"$error":"#N/A"}},{"$f":"0.5*(2.08*Press + 1440)","v":2280},2850,700,1000,2000,1500,"-",2400,2400,"Bckt & Cplgr","F07",15.95,null,3099.7950000000001,null,"y = -0.0003x2 + 1.6217x + 1051.6"]
["4.00",{"$f":"0.9729*Press + 1000","v":2459.35},{"$f":"-0.0012*Press^2 + 2.6265*Press + 1755.1","v":2994.8500000000004},{"$f":"-0.0012*Press^2 + 2.6265*Press + 1755.1","v":2994.8500000000004},{"$f":"-0.0002*Press^2 + 1.6132*Press + 1491.8","v":3461.5999999999995},{"$f":"NA()","v":{"$error":"#N/A"}},{"$f":"0.5*(3.04*Press + 2160)","v":3360},4200,700,1000,1500,1000,"-",1500,1500,"Bckt & Cplgr","F07",17.8,null,3689.0249999999996,null,"y = -0.0002x2 + 1.6132x + 1491.8"]
["--","--","--","--","--","--","--","--","--","--","--","--","--","--","--","--","--","--"]
["Torques do not agree w/ Bulletin 3000-1098 G."]
["3000 & 10000 Torques Same"]
["Yellow shaded cells contain eqn. and / or logic statement."]
[]
["3000F Series Full Port",null,null,null,"_3000F",null,null,null,"Press =",{"$f":"Press","v":1500},"psi"]
[null,"Torque, lbf-in.",null,null,null,null,null,null,"Max. Seat Pressure",null,null,null,null,null,null,"Mounting"]
[null,"Teflon","RPTFE","CRPTFE","UHMW-PE","Delrin","PEEK","CPEEK","T","R","S","U","D","P","CP","Mount","Blt Ptrn","Sq",null,"UHMW_PE"]
["Size           Col.",2,3,4,5,6,7,8,9,10,11,12,13,14,15,10,11,12,null,"1.5 PTFE"]
["0.25",72,72,72,{"$f":"1.5*$B27","v":108},{"$f":"0.0107*Press + 84","v":100.05},{"$f":"0.5*(0.02*Press + 240)","v":135},{"$f":"1.25*G27","v":168.75},"NA","NA","NA","NA",4000,4000,4000,"Bckt & Cplgr","F03",5.44,null,{"$f":"1.5*$B27","v":108}]
["0.38",72,72,72,{"$f":"1.5*$B28","v":108},{"$f":"0.0107*Press + 84","v":100.05},{"$f":"0.5*(0.02*Press + 240)","v":135},{"$f":"1.25*G28","v":168.75},"NA","NA","NA","NA",4000,4000,4000,"Bckt & Cplgr","F03",5.44,null,{"$f":"1.5*B28","v":108}]
["0.50",72,96,96,108,{"$f":"0.0107*Press + 108","v":124.05},{"$f":"0.5*(0.03*Press + 360)","v":202.5},253.125,"NA","NA","NA","NA",4000,4000,4000,"Bckt & Cplgr","F03",5.44,null,108]
["0.75",108,120,120,162,{"$f":"0.0133*Press + 160","v":179.95},{"$f":"0.5*(0.08*Press + 720)","v":420},525,"NA","NA","NA","NA",4000,3200,3200,"Bckt & Cplgr","F04",7.47,null,162]
["1.00",204,240,240,306,{"$f":"0.0267*Press + 200","v":240.05},{"$f":"0.5*(0.1*Press + 840)","v":495},618.75,"NA","NA","NA","NA",4000,3200,3200,"Bckt & Cplgr","F04",7.47,null,306]
["1.25",220,{"$f":"0.0636*Press + 260","v":355.4},{"$f":"0.0636*Press + 260","v":355.4},330,{"$f":"0.0444*Press + 250","v":316.60000000000002},{"$f":"0.5*(0.5*Press + 950)","v":850},1062.5,"NA",1500,2200,"NA",3200,3200,3200,"Bckt & Cplgr","F05",8.92,null,330]
["1.50",240,{"$f":"0.00006*Press^2 + 0.0457*Press + 289.58","v":493.13},{"$f":"0.00006*Press^2 + 0.0457*Press + 289.58","v":493.13},360,{"$f":"0.08*Press + 280","v":400},{"$f":"0.5*(0.72*Press + 1140)","v":1110},1387.5,"NA",1500,2200,"NA",3200,3200,3200,"Bckt & Cplgr","F05",8.92,null,360]
["2.00",432,{"$f":"0.34*Press + 780","v":1290},{"$f":"0.34*Press + 780","v":1290},648,{"$f":"NA()","v":{"$error":"#N/A"}},{"$f":"0.5*(1.173*Press + 1320)","v":1539.75},1924.6875,"NA",1000,2000,"NA","--",2400,2400,"Bckt & Cplgr","F05",13.71,null,648]
["2.50",{"$f":"0.8981*Press + 719.38","v":2066.5300000000002},{"$f":"-0.0006*Press^2 + 1.8923*Press + 1255.4","v":2743.8500000000004},{"$f":"-0.0006*Press^2 + 1.8923*Press + 1255.4","v":2743.8500000000004},{"$f":"-0.0003*Press^2+1.6217*Press+1051.6","v":2809.1499999999996},{"$f":"NA()","v":{"$error":"#N/A"}},{"$f":"0.5*(2.08*Press + 1440)","v":2280},2850,700,1000,2000,1500,"--",2400,2400,"Bckt & Cplgr","F07",15.95,null,3099.7950000000001]
["3.00",{"$f":"0.9729*Press + 1000","v":2459.35},{"$f":"-0.0012*Press^2 + 2.6265*Press + 1755.1","v":2994.8500000000004},{"$f":"-0.0012*Press^2 + 2.6265*Press + 1755.1","v":2994.8500000000004},{"$f":"-0.0002*Press^2 + 1.6132*Press + 1491.8","v":3461.5999999999995},{"$f":"NA()","v":{"$error":"#N/A"}},{"$f":"0.5*(3.04*Press + 2160)","v":3360},4200,700,1000,1500,1000,"--",1500,1500,"Bckt & Cplgr","F07",17.8,null,3689.0249999999996]
["--","--","--","--","--","--","--","--","--","--","--","--","--","--","--","--","--","--"]
["Torques do not agree w/ Bulletin 3000-1098 G."]
["3000 & 10000 Torques Same"]
["Yellow shaded cells contain eqn. and / or logic statement."]
[]
[]
[]
[]
[]
[]
["10000F Series Full (Sch 160) Port",null,null,null,"_10000F",null,null,null,"Press =",{"$f":"Press","v":1500},"psi"]
[null,"Torque, lbf-in.",null,null,null,null,null,null,"Max. Seat Pressure",null,null,null,null,null,null,"Mounting"]
[null,null,"R","S",null,"Delrin","PEEK","CPEEK",null,"R","S",null,"D","P","CP","Mount","Blt Ptrn","Sq"]
["Size           Col.",2,3,4,5,6,7,8,9,10,11,12,13,12,15,10,11,12]
["0.25",null,96,96,null,{"$f":"0.0107*Press + 108","v":124.05},{"$f":"0.5*(0.03*Press + 360)","v":202.5},{"$f":"1.25*G51","v":253.125},null,"NA",2800,null,6000,6000,6000,"Bckt & Cplgr","--",7.47]
["0.38",null,96,96,null,{"$f":"0.0107*Press + 108","v":124.05},{"$f":"0.5*(0.03*Press + 360)","v":202.5},253.125,null,"NA",2800,null,6000,6000,6000,"Bckt & Cplgr","--",7.47]
["0.50",null,96,96,null,{"$f":"0.0107*Press + 108","v":124.05},{"$f":"0.5*(0.03*Press + 360)","v":202.5},253.125,null,"NA",2800,null,6000,6000,6000,"Bckt & Cplgr","--",7.47]
["0.75",null,195,195,null,{"$f":"0.0133*Press + 160","v":179.95},{"$f":"0.5*(0.08*Press + 720)","v":420},525,null,"NA",2800,null,6000,6000,6000,"Bckt & Cplgr","F04",7.47]
["1.00",null,240,240,null,{"$f":"0.0267*Press + 200","v":240.05},{"$f":"0.5*(0.1*Press + 840)","v":495},618.75,null,"NA",2800,null,4500,6000,6000,"Bckt & Cplgr","F04",8.52]
["1.25",null,{"$f":"0.00006*Press^2 + 0.0457*Press + 289.58","v":493.13},{"$f":"0.00006*Press^2 + 0.0457*Press + 289.58","v":493.13},null,{"$f":"0.08*Press + 280","v":400},{"$f":"0.5*(0.72*Press + 1140)","v":1110},1387.5,null,1500,2500,null,4500,5000,5000,"Bckt & Cplgr","F07",15.95]
["1.50",null,{"$f":"0.00006*Press^2 + 0.0457*Press + 289.58","v":493.13},{"$f":"0.00006*Press^2 + 0.0457*Press + 289.58","v":493.13},null,{"$f":"0.08*Press + 280","v":400},{"$f":"0.5*(0.72*Press + 1140)","v":1110},1387.5,null,1000,2500,null,4500,5000,5000,"Bckt & Cplgr","F07",15.95,null,"Note:  UT-3-SR-60 would not turn 1.5\" 10K w/ Delrin seats /"]
["2.00",null,{"$f":"0.34*Press + 780","v":1290},{"$f":"0.34*Press + 780","v":1290},null,{"$f":"0.175*Press + 375","v":637.5},{"$f":"0.5*(2.08*Press + 1440)","v":2280},2850,null,1000,2500,null,4500,5000,5000,"Bckt & Cplgr","F07",15.95,null,"Grafoil-Viton stem seal on RI test bench 5/23/07 (CO8030639). "]
["3.00 x 2.00",null,{"$f":"0.34*Press + 780","v":1290},{"$f":"0.34*Press + 780","v":1290},null,{"$f":"0.175*Press + 375","v":637.5},{"$f":"0.5*(2.08*Press + 1440)","v":2280},2850,null,1000,2500,null,4500,5000,5000,"Bckt & Cplgr","F07",15.95,null,"Changed to UT-4.5-SR-60 for 3000 to 4500 psi operating pressure."]
["--",null,"--","--","--","--","--","--","--","--","--","--","--","--","--","--","--","--"]
["--",null,"--","--","--","--","--","--","--","--","--","--","--","--","--","--","--","--"]
["3000 & 10000 Torques Same"]
["Yellow shaded cells contain eqn. and / or logic statement."]
[]
["PTFE, RPTFE, and CRPTFE deleted per D. Behm request 7/16/04"]
[]
[]
[]
[]
[]
["MS3K 3-Pc Metal Seated, Sch. 160 Port, 1000 WOG",null,null,null,null,"_MS3000",null,null,"Press =",{"$f":"Press","v":1500},"psi"]
[null,"Torque, lbf-in.",null,null,null,null,null,null,"Max. Seat Pressure",null,null,null,null,null,null,null,"Mounting"]
[null,"MarWear Metal CL4","MarWear Metal CL5","Marwinite Carbon CL6",null,null,null,null,"W4","W5","M6",null,null,null,null,null,"Mount","Sq"]
["Size           Col.",2,3,4,5,6,7,8,9,10,11,12,13,14,15,null,16,17]
["0.25",{"$f":"0.5*(0.03*Press + 360)","v":202.5},{"$f":"0.5*(0.02*Press + 240)","v":135},135,"--","--","--",null,1000,1000,750,"-","-",null,"-"]
["0.38",{"$f":"0.5*(0.03*Press + 360)","v":202.5},135,135,"--","--","--",null,1000,1000,750,"-","-",null,"-"]
["0.50",{"$f":"0.5*(0.03*Press + 360)","v":202.5},135,135,"--","--","--",null,1000,1000,750,"-","-",null,"-"]
["0.75",{"$f":"0.5*(0.08*Press + 720)","v":420},{"$f":"0.5*(0.08*Press + 600)","v":360},{"$f":"0.5*(0.08*Press + 600)","v":360},"--","--","--",null,1000,1000,750,"-","-",null,"-"]
["1.00",{"$f":"0.5*(0.1*Press + 840)","v":495},{"$f":"0.5*(0.1*Press +700)","v":425},{"$f":"0.5*(0.1*Press +700)","v":425},"--","--","--",null,1000,1000,750,"-","-",null,"-"]
["1.25",{"$f":"0.5*(0.5*Press + 950)","v":850},{"$f":"0.5*(0.5*Press + 750)","v":750},{"$f":"0.5*(0.5*Press + 750)","v":750},"--","--","--",null,1000,1000,750,"-","-",null,"-"]
["1.50",{"$f":"0.5*(0.5*Press + 950)","v":850},{"$f":"0.5*(0.5*Press + 750)","v":750},{"$f":"0.5*(0.5*Press + 750)","v":750},"--","--","--",null,1000,1000,750,"-","-",null,"-"]
["2.00",{"$f":"0.5*(1.173*Press + 1320)","v":1539.75},{"$f":"0.5*(1.173*Press + 1000)","v":1379.75},{"$f":"0.5*(1.173*Press + 1000)","v":1379.75},"--","--","--",null,1000,1000,750,"-","-",null,"-"]
["3.00 x 2.00",{"$f":"0.5*(1.173*Press + 1320)","v":1539.75},{"$f":"0.5*(1.173*Press + 1000)","v":1379.75},{"$f":"0.5*(1.173*Press + 1000)","v":1379.75},"--","--","--",null,1000,1000,750,"-","-",null,"-"]
["--","--","--","--","--","--","--",null,"-","-","-","-","-",null,"-"]
["--","--","--","--","--","--","--",null,"-","-","-","-","-",null,"-"]
["Yellow shaded cells contain eqn. and / or logic statement."]
["1000 was 1440 in columns 9 & 10; W5 was W6; W4 & M6 eliminated"]
[]
[]
["MS10K 3-Pc Metal Seated, Sch. 160 Port, 4500 WOG<=1.25 / 3700 WOG > 1.25",null,null,null,null,null,null,"_MS10000","Press =",{"$f":"Press","v":1500},"psi"]
[null,"Torque, lbf-in.",null,null,null,null,null,null,"Max. Seat Pressure",null,null,null,null,null,null,null,"Mounting"]
[null,"MarWear Metal CL4","MarWear Metal CL5",null,null,null,null,null,"M4","W5",null,null,null,null,null,null,"Mount","Sq"]
["Size           Col.",2,3,4,5,6,7,8,9,10,11,12,13,14,15,null,16,17]
["0.25",{"$f":"0.5*(0.03*Press + 360)","v":202.5},{"$f":"0.5*(0.02*Press + 240)","v":135},"--","--","--","--",null,4500,4500,"-","-","-",null,"-"]
["0.38",{"$f":"0.5*(0.03*Press + 360)","v":202.5},{"$f":"0.5*(0.02*Press + 240)","v":135},"--","--","--","--",null,4500,4500,"-","-","-",null,"-"]
["0.50",{"$f":"0.5*(0.03*Press + 360)","v":202.5},{"$f":"0.5*(0.02*Press + 240)","v":135},"--","--","--","--",null,4500,4500,"-","-","-",null,"-"]
["0.75",{"$f":"0.5*(0.08*Press + 720)","v":420},{"$f":"0.5*(0.08*Press + 600)","v":360},"--","--","--","--",null,4500,4500,"-","-","-",null,"-"]
["1.00",{"$f":"0.5*(0.1*Press + 840)","v":495},{"$f":"0.5*(0.1*Press +700)","v":425},"--","--","--","--",null,4500,4500,"-","-","-",null,"-"]
["1.25",{"$f":"0.5*(0.5*Press + 950)","v":850},{"$f":"0.5*(0.5*Press + 750)","v":750},"--","--","--","--",null,3700,3700,"-","-","-",null,"-"]
["1.50",{"$f":"0.5*(0.5*Press + 950)","v":850},{"$f":"0.5*(0.5*Press + 750)","v":750},"--","--","--","--",null,3700,3700,"-","-","-",null,"-"]
["2.00",{"$f":"0.5*(1.173*Press + 1320)","v":1539.75},{"$f":"0.5*(1.173*Press + 1000)","v":1379.75},"--","--","--","--",null,3700,3700,"-","-","-",null,"-"]
["3.00 x 2.00",{"$f":"0.5*(1.173*Press + 1320)","v":1539.75},{"$f":"0.5*(1.173*Press + 1000)","v":1379.75},"--","--","--","--",null,3700,3700,"-","-","-",null,"-"]
["--","--","--","--","--","--","--",null,"-","-","-","-","-",null,"-"]
["--","--","--","--","--","--","--",null,"-","-","-","-","-",null,"-"]
["Yellow shaded cells contain eqn. and / or logic statement."]
["W5 was W6; W4 & M6 eliminated"]

{"sheet":"4K","index":11,"n_rows":39,"n_cols":12,"rows_kept":39,"cut":false,"hidden":true,"merged":[[3,1,3,4],[21,1,21,4],[3,5,3,8],[21,5,21,8],[3,9,3,11],[21,9,21,11]]}
[]
[]
["4600R Series Reduced Port",null,null,null,"_4000R"]
[null,"Torque (Break), lbf-in.",null,null,null,"Max. Seat Pressure",null,null,null,"Mounting"]
[null,"Teflon","RPTFE","Delrin","PEEK","T","R","D","P","Mount","Blt Ptrn","Sq"]
["Size           Col.",2,3,4,5,6,7,8,9,10,11,12]
["0.25",{"$f":"IF(Press<=100,45,65)","v":65},"--","--","--",600,"NA","NA","NA","--","--","--"]
["0.38",{"$f":"IF(Press<=100,45,65)","v":65},"--","--","--",600,"NA","NA","NA","--","--","--"]
["0.50",{"$f":"IF(Press<=100,45,65)","v":65},"--","--","--",600,"NA","NA","NA","--","--","--"]
["0.75",{"$f":"IF(Press<=100,50,80)","v":80},"--","--","--",600,"NA","NA","NA","--","--","--"]
["1.00",{"$f":"IF(Press<=100,125,230)","v":230},"--","--","--",600,"NA","NA","NA","--","--","--"]
["1.25",{"$f":"IF(Press<=100,125,230)","v":230},"--","--","--",600,"NA","NA","NA","Saddle","--",6]
["1.50",{"$f":"IF(Press<=100,150,275)","v":275},"--","--","--",600,"NA","NA","NA","Saddle","--",10]
["2.00",{"$f":"IF(Press<=100,170,300)","v":300},"--","--","--",600,"NA","NA","NA","Saddle","--",10]
["2.50",{"$f":"IF(Press<=100,250,410)","v":410},"--","--","--",600,"NA","NA","NA","Saddle","--",10]
["3.00",{"$f":"IF(Press<=100,370,540)","v":540},"--","--","--",600,"NA","NA","NA","Saddle","--",11]
["Sizes 0.25-1.00 Nibco 595-Y; Sizes 1.25-2.5 Nibco 590-Y-66"]
["Yellow shaded cells contain logic statement."]
[]
[]
["4600F Series Full Port",null,null,null,"_4000F"]
[null,"Torque (Break), lbf-in.",null,null,null,"Max. Seat Pressure",null,null,null,"Mounting"]
[null,"Teflon","RPTFE","Delrin","PEEK","T","R","D","P","Mount","Blt Ptrn","Sq"]
["Size           Col.",2,3,4,5,6,7,8,9,10,11,12]
["0.25",{"$f":"IF(Press<=100,45,65)","v":65},"--","--","--",600,"NA","NA","NA","Saddle","--",5]
["0.38",{"$f":"IF(Press<=100,45,65)","v":65},"--","--","--",600,"NA","NA","NA","Saddle","--",5]
["0.50",{"$f":"IF(Press<=100,45,65)","v":65},"--","--","--",600,"NA","NA","NA","Saddle","--",5]
["0.75",{"$f":"IF(Press<=100,50,80)","v":80},"--","--","--",600,"NA","NA","NA","Saddle","--",6]
["1.00",{"$f":"IF(Press<=100,125,230)","v":230},"--","--","--",600,"NA","NA","NA","Saddle","--",10]
["1.25",{"$f":"IF(Press<=100,150,275)","v":275},"--","--","--",600,"NA","NA","NA","Saddle","--",10]
["1.50",{"$f":"IF(Press<=100,170,300)","v":300},"--","--","--",600,"NA","NA","NA","Saddle","--",10]
["2.00",{"$f":"IF(Press<=100,250,410)","v":410},"--","--","--",600,"NA","NA","NA","Saddle","--",10]
["2.50",{"$f":"IF(Press<=100,370,540)","v":540},"--","--","--",600,"NA","NA","NA","Saddle","--",11]
["--","--","--","--","--","--","--","--","--","--","--","--"]
["Nibco 595-Y"]
["Yellow shaded cells contain logic statement."]
[]
[]
["For 4700, See 8K tab"]

{"sheet":"5K 6K","index":12,"n_rows":158,"n_cols":18,"rows_kept":158,"cut":false,"hidden":true,"merged":[[121,6,121,10],[141,6,141,10],[81,6,81,10],[101,6,101,10],[81,11,81,13],[101,11,101,13],[121,11,121,13],[141,11,141,13],[40,6,40,10],[58,6,58,10],[3,6,3,10],[21,6,21,10],[3,11,3,13],[21,11,21,13],[40,11,40,13],[58,11,58,13],[121,1,121,5],[141,1,141,5],[3,1,3,5],[21,1,21,5],[40,1,40,5],[58,1,58,5],[81,1,81,5],[101,1,101,5]]}
[]
[]
["5000R Series Reduced Port",null,null,null,"_5000R",null,"Press =",{"$f":"Press","v":1500},"psi"]
[null,"Torque, lbf-in.",null,null,null,null,"Max. Seat Pressure",null,null,null,null,"Mounting"]
[null,"Teflon","RPTFE","CRPTFE","UHMW-PE","P","T","R","S","U","P","Mount","Blt Ptrn","Sq",null,null,null,"UHMW-PE"]
["Size           Col.",2,3,4,5,6,7,8,9,10,11,10,11,12,null,null,null,"1.3 PTFE"]
["0.50",{"$f":"0.85*C7","v":305.44749999999999},{"$f":"IF(Press<=100,60,0.0001*Press^2 +0.0529*Press + 55)","v":359.35},{"$f":"1.1*C7","v":395.28500000000008},{"$f":"1.3*$B7","v":397.08175},"--",285,285,285,285,"--","Bckt & Cplgr","Spl",5,null,null,null,{"$f":"1.3*$B7","v":397.08175}]
["0.75",305.44749999999999,{"$f":"IF(Press<=100,60,0.0001*Press^2 + 0.0529*Press + 55)","v":359.35},395.28500000000008,{"$f":"1.3*$B8","v":397.08175},"--",285,285,285,285,"--","Bckt & Cplgr","Spl",5,null,null,null,{"$f":"1.3*$B8","v":397.08175}]
["1.00",291.97499999999997,{"$f":"IF(Press<=100,85,0.0001*Press^2 + 0.025*Press + 81)","v":343.5},377.85,379.5675,"--",285,285,285,285,"--","Bckt & Cplgr","Spl",8,null,null,null,379.5675]
["1.50",294.52499999999998,{"$f":"IF(Press<=100,150,0.141*Press + 135)","v":346.5},381.15000000000003,382.88249999999999,"--",285,285,285,285,"--","Bckt & Cplgr","Spl",14,null,null,null,382.88249999999999]
["2.00",486.66749999999996,{"$f":"IF(Press<=100,300,0.1937*Press + 282)","v":572.54999999999995},629.80499999999995,632.66774999999996,"--",285,285,285,285,"--","Bckt & Cplgr","Spl",14,null,null,null,632.66774999999996]
["3.00",889.3125,{"$f":"IF(Press<=100,500,0.3895*Press + 462)","v":1046.25},1150.875,1156.10625,"--",285,285,285,285,"--","Bckt & Cplgr","Spl",18,null,null,null,1156.10625]
["4.00",1983.8999999999999,{"$f":"IF(Press<=100,950,0.97*Press + 879)","v":2334},2567.4,2579.0699999999997,"--",285,285,285,285,"--","Bckt & Cplgr","Spl",22.5,null,null,null,2579.0699999999997]
["6.00",4006.0499999999997,{"$f":"IF(Press<=100,1550,2.25*Press + 1338)","v":4713},5184.3,5207.8649999999998,"--",285,285,285,285,"--","Bckt & Cplgr","Spl",30,null,null,null,5207.8649999999998]
["8.00",10051.6325,{"$f":"IF(Press<=100,3500,5.9783*Press + 2858)","v":11825.45},13007.995000000003,13067.12225,"--",285,285,285,285,"--","Bckt & Cplgr","Spl",30,null,null,null,13067.12225]
["10.00",15227.75,{"$f":"IF(Press<=100,7000,7.78*Press + 6245)","v":17915},19706.5,19796.075000000001,"--",285,285,285,285,"--","Bckt & Cplgr","Spl",30,null,null,null,19796.075000000001]
["--","--","--","--","--","--","--","--","--","--","--","--","--","--"]
["RPTFE agrees w/ Bulletin 5000-0600 G; Teflon = 0.85 RPTFE, CRPTFE = RPTFE",null,null,null,null,"RPTFE changed 2/4/06; PTFE = 0.85 x new RPTFE; CRPTFE changed from 1.0 to 1.1 x RPTFE."]
["Yellow shaded cells contain eqn. and / or logic statement."]
[]
["5000F Series Full Port",null,null,null,"_5000F",null,"Press =",{"$f":"Press","v":1500},"psi"]
[null,"Torque, lbf-in.",null,null,null,null,"Max. Seat Pressure",null,null,null,null,"Mounting"]
[null,"Teflon","RPTFE","CRPTFE","UHMW-PE","P","T","R","S","U","P","Mount","Blt Ptrn","Sq",null,null,null,"UHMW-PE"]
["Size           Col.",2,3,4,5,6,7,8,9,10,11,10,11,12,null,null,null,"1.3 PTFE"]
["0.50",{"$f":"0.85*C25","v":305.44749999999999},{"$f":"IF(Press<=100,60,0.0001*Press^2 + 0.0529*Press + 55)","v":359.35},{"$f":"1.1*C25","v":395.28500000000008},{"$f":"1.3*$B25","v":397.08175},"--",285,285,285,285,"--","Bckt & Cplgr","Spl",5,null,null,null,{"$f":"1.3*$B25","v":397.08175}]
["0.75",{"$f":"0.85*C26","v":291.97499999999997},{"$f":"IF(Press<=100,85,0.0001*Press^2 + 0.025*Press + 81)","v":343.5},377.85,{"$f":"1.3*$B26","v":379.5675},"--",285,285,285,285,"--","Bckt & Cplgr","Spl","--",null,null,null,{"$f":"1.3*$B26","v":379.5675}]
["1.00",294.52499999999998,{"$f":"IF(Press<=100,150,0.141*Press + 135)","v":346.5},381.15000000000003,382.88249999999999,"--",285,285,285,285,"--","Bckt & Cplgr","Spl",8,null,null,null,382.88249999999999]
["1.50",486.66749999999996,{"$f":"IF(Press<=100,300,0.1937*Press + 282)","v":572.54999999999995},629.80499999999995,632.66774999999996,"--",285,285,285,285,"--","Bckt & Cplgr","Spl",14,null,null,null,632.66774999999996]
["2.00",889.3125,{"$f":"IF(Press<=100,500,0.3895*Press + 462)","v":1046.25},1150.875,1156.10625,"--",285,285,285,285,"--","Bckt & Cplgr","Spl",14,null,null,null,1156.10625]
["3.00",1983.8999999999999,{"$f":"IF(Press<=100,950,0.97*Press + 879)","v":2334},2567.4,2579.0699999999997,"--",285,285,285,285,"--","Bckt & Cplgr","Spl",18,null,null,null,2579.0699999999997]
["4.00",{"$f":"0.85*C31","v":4006.0499999999997},{"$f":"IF(Press<=100,1550,2.25*Press + 1338)","v":4713},5184.3,5207.8649999999998,"--",285,285,285,285,"--","Bckt & Cplgr","Spl",22.5,null,null,null,5207.8649999999998]
["6.00",10051.6325,{"$f":"IF(Press<=100,3500,5.9783*Press + 2858)","v":11825.45},13007.995000000003,13067.12225,"--",285,285,285,285,"--","Bckt & Cplgr","Spl",30,null,null,null,13067.12225]
["8.00",15227.75,{"$f":"IF(Press<=100,7000,7.78*Press + 6245)","v":17915},19706.5,19796.075000000001,"--",285,285,285,285,"--","Bckt & Cplgr","Spl",30,null,null,null,19796.075000000001]
["--","--","--","--","--","--","--","--","--","--","--","--","--","--"]
["RPTFE agrees w/ Bulletin 5000-0600 G; Teflon = 0.85 RPTFE, CRPTFE = RPTFE",null,null,null,null,"RPTFE changed 2/4/06; PTFE = 0.85 x new RPTFE; CRPTFE changed from 1.0 to 1.1 x RPTFE."]
["Yellow shaded cells contain eqn. and / or logic statement."]
[]
[]
[]
["6000R Series Reduced Port",null,null,null,"_6000R",null,"Press =",{"$f":"Press","v":1500},"psi"]
[null,"Torque, lbf-in.",null,null,null,null,"Max. Seat Pressure",null,null,null,null,"Mounting"]
[null,"Teflon","RPTFE","CRPTFE","UHMW-PE","PEEK","T","R","S","U","P","Mount","Blt Ptrn","Sq",null,null,null,"UHMW-PE"]
["Size           Col.",2,3,4,5,6,7,8,9,10,11,10,11,12,null,null,null,"1.3 PTFE"]
["0.50",{"$f":"0.85*C44","v":305.44749999999999},{"$f":"IF(Press<=100,60,0.0001*Press^2 + 0.0529*Press + 55)","v":359.35},{"$f":"1.1*C44","v":395.28500000000008},{"$f":"1.3*$B44","v":397.08175},"--",740,740,740,740,"--","Bckt & Cplgr","Spl",5,null,null,null,{"$f":"1.3*$B44","v":397.08175}]
["0.75",{"$f":"0.85*C45","v":305.44749999999999},{"$f":"IF(Press<=100,60,0.0001*Press^2 + 0.0529*Press + 55)","v":359.35},395.28500000000008,{"$f":"1.3*$B45","v":397.08175},"--",740,740,740,740,"--","Bckt & Cplgr","Spl",5,null,null,null,{"$f":"1.3*$B45","v":397.08175}]
["1.00",{"$f":"0.85*C46","v":291.97499999999997},{"$f":"IF(Press<=100,85,0.0001*Press^2 + 0.025*Press + 81)","v":343.5},377.85,379.5675,"--",740,740,740,740,"--","Bckt & Cplgr","Spl",8,null,null,null,379.5675]
["1.50",294.52499999999998,{"$f":"IF(Press<=100,150,0.141*Press + 135)","v":346.5},381.15000000000003,382.88249999999999,"--",740,740,740,740,"--","Bckt & Cplgr","Spl",14,null,null,null,382.88249999999999]
["2.00",486.66749999999996,{"$f":"IF(Press<=100,300,0.1937*Press + 282)","v":572.54999999999995},629.80499999999995,632.66774999999996,"--",740,740,740,740,"--","Bckt & Cplgr","Spl",14,null,null,null,632.66774999999996]
["3.00",889.3125,{"$f":"IF(Press<=100,500,0.3895*Press + 462)","v":1046.25},1150.875,1156.10625,"--",740,740,740,740,"--","Bckt & Cplgr","Spl",18,null,null,null,1156.10625]
["4.00",1983.8999999999999,{"$f":"IF(Press<=100,950,0.97*Press + 879)","v":2334},2567.4,2579.0699999999997,"--",740,740,740,740,"--","Bckt & Cplgr","Spl",22.5,null,null,null,2579.0699999999997]
["6.00",4006.0499999999997,{"$f":"IF(Press<=100,1550,2.25*Press + 1338)","v":4713},5184.3,5207.8649999999998,{"$f":"1.4*C51","v":6598.2},740,740,740,740,"--","Bckt & Cplgr","Spl",30,null,null,null,5207.8649999999998]
["8.00",10051.6325,{"$f":"IF(Press<=100,3500,5.9783*Press + 2858)","v":11825.45},13007.995000000003,13067.12225,"--",740,740,740,740,"--","Bckt & Cplgr","Spl",30,null,null,null,13067.12225]
["10.00",15227.75,{"$f":"IF(Press<=100,7000,7.78*Press + 6245)","v":17915},19706.5,19796.075000000001,"--",740,740,740,740,"--","Bckt & Cplgr","Spl",30,null,null,null,19796.075000000001]
["--","--","--","--","--","--","--","--","--","--","--","--","--","--"]
["RPTFE agrees w/ Bulletin 5000-0600 G; Teflon = 0.85 RPTFE, CRPTFE = RPTFE",null,null,null,null,"RPTFE changed 2/4/06; PTFE = 0.85 x new RPTFE; CRPTFE changed from 1.0 to 1.1 x RPTFE."]
["Yellow shaded cells contain eqn. and / or logic statement."]
[]
["6000F Series Full Port",null,null,null,"_6000F",null,"Press =",{"$f":"Press","v":1500},"psi"]
[null,"Torque, lbf-in.",null,null,null,null,"Max. Seat Pressure",null,null,null,null,"Mounting"]
[null,"Teflon","RPTFE","CRPTFE","UHMW-PE","PEEK","T","R","S","U","P","Mount","Blt Ptrn","Sq",null,null,null,"UHMW-PE"]
["Size           Col.",2,3,4,5,6,7,8,9,10,11,10,11,12,null,null,null,"1.3 PTFE"]
["0.50",{"$f":"0.85*C62","v":305.44749999999999},{"$f":"IF(Press<=100,60,0.0001*Press^2 + 0.0529*Press + 55)","v":359.35},{"$f":"1.1*C62","v":395.28500000000008},{"$f":"1.3*$B62","v":397.08175},"--",740,740,740,740,"--","Bckt & Cplgr","Spl",5,null,null,null,{"$f":"1.3*$B62","v":397.08175}]
["0.75",{"$f":"0.85*C63","v":291.97499999999997},{"$f":"IF(Press<=100,85,0.0001*Press^2 + 0.025*Press + 81)","v":343.5},377.85,{"$f":"1.3*$B63","v":379.5675},"--",740,740,740,740,"--","Bckt & Cplgr","Spl","--",null,null,null,{"$f":"1.3*$B63","v":379.5675}]
["1.00",294.52499999999998,{"$f":"IF(Press<=100,150,0.141*Press + 135)","v":346.5},381.15000000000003,382.88249999999999,"--",740,740,740,740,"--","Bckt & Cplgr","Spl",8,null,null,null,382.88249999999999]
["1.50",486.66749999999996,{"$f":"IF(Press<=100,300,0.1937*Press + 282)","v":572.54999999999995},629.80499999999995,632.66774999999996,"--",740,740,740,740,"--","Bckt & Cplgr","Spl",14,null,null,null,632.66774999999996]
["2.00",889.3125,{"$f":"IF(Press<=100,500,0.3895*Press + 462)","v":1046.25},1150.875,1156.10625,"--",740,740,740,740,"--","Bckt & Cplgr","Spl",14,null,null,null,1156.10625]
["3.00",1983.8999999999999,{"$f":"IF(Press<=100,950,0.97*Press + 879)","v":2334},2567.4,2579.0699999999997,"--",740,740,740,740,"--","Bckt & Cplgr","Spl",18,null,null,null,2579.0699999999997]
["4.00",4006.0499999999997,{"$f":"IF(Press<=100,1550,2.25*Press + 1338)","v":4713},5184.3,5207.8649999999998,"--",740,740,740,740,"--","Bckt & Cplgr","Spl",22.5,null,null,null,5207.8649999999998]
["6.00",10051.6325,{"$f":"IF(Press<=100,3500,5.9783*Press + 2858)","v":11825.45},13007.995000000003,13067.12225,"--",740,740,740,740,"--","Bckt & Cplgr","Spl",30,null,null,null,13067.12225]
["8.00",15227.75,{"$f":"IF(Press<=100,7000,7.78*Press + 6245)","v":17915},19706.5,19796.075000000001,"--",740,740,740,740,"--","Bckt & Cplgr","Spl",30,null,null,null,19796.075000000001]
["--","--","--","--","--","--","--","--","--","--","--","--","--","--"]
["RPTFE agrees w/ Bulletin 5000-0600 G; Teflon = 0.85 RPTFE, CRPTFE = RPTFE",null,null,"RPTFE changed 2/4/06; PTFE = 0.85 x new RPTFE; CRPTFE changed from 1.0 to 1.1 x RPTFE."]
["Yellow shaded cells contain eqn. and / or logic statement."]
[]
[]
[]
[]
[]
[]
[null,null,null,null,"_5801R"]
["5801R Series Reduced Port",null,null,null,"_5800R",null,"Press =",{"$f":"Press","v":1500},"psi"]
[null,"Torque, lbf-in.",null,null,null,null,"Max. Seat Pressure",null,null,null,null,"Mounting"]
[null,"Teflon","RPTFE","CRPTFE","UHMW-PE","PEEK","T","R","S","U","P","Mount","Blt Ptrn","Sq",null,null,null,"UHMW-PE"]
["Size           Col.",2,3,4,5,6,7,8,9,10,11,10,11,12,null,null,null,"1.3 PTFE"]
["0.50",{"$f":"NA()","v":{"$error":"#N/A"}},{"$f":"1.15*B85","v":{"$error":"#N/A"}},{"$f":"1.25*B85","v":{"$error":"#N/A"}},{"$f":"1.3*$B85","v":{"$error":"#N/A"}},"--","NA","NA","NA","NA","--","Bckt & Cplgr","--","--",null,null,null,{"$f":"1.3*$B85","v":{"$error":"#N/A"}}]
["0.75",{"$f":"NA()","v":{"$error":"#N/A"}},{"$f":"1.15*B86","v":{"$error":"#N/A"}},{"$error":"#N/A"},{"$f":"1.3*$B86","v":{"$error":"#N/A"}},"--","NA","NA","NA","NA","--","Bckt & Cplgr","--","--",null,null,null,{"$f":"1.3*$B86","v":{"$error":"#N/A"}}]
["1.00",{"$f":"IF(Press<=285,80, 80+(Press-285)/455*38)","v":181.47252747252747},208.69340659340659,226.84065934065933,{"$f":"1.3*$B87","v":235.91428571428571},"--",285,285,285,285,"--","Bckt & Cplgr","F05",8,null,null,null,{"$f":"1.3*$B87","v":235.91428571428571}]
["1.50",{"$f":"IF(Press<=285,155, 155+(Press-285)/455*100)","v":422.03296703296701},485.337912087912,527.54120879120876,548.64285714285711,"--",285,285,285,285,"--","Bckt & Cplgr","F05",10,null,null,null,548.64285714285711]
["2.00",{"$f":"IF(Press<=285,190, 190+(Press-285)/455*160)","v":617.25274725274721},709.84065934065927,771.56593406593402,802.42857142857144,"--",285,285,285,285,"--","Bckt & Cplgr","F07",14,null,null,null,802.42857142857144]
["2.50",{"$f":"NA()","v":{"$error":"#N/A"}},{"$error":"#N/A"},{"$error":"#N/A"},{"$error":"#N/A"},"--","NA","NA","NA","NA","--","Bckt & Cplgr","--","--",null,null,null,{"$error":"#N/A"}]
["3.00",{"$f":"IF(Press<=285,400,400+(Press-285)/455*425)","v":1534.8901098901099},1765.1236263736262,1918.6126373626373,1995.3571428571429,"--",285,285,285,285,"--","Bckt & Cplgr","F10",16,null,null,null,1995.3571428571429]
["4.00",{"$f":"IF(Press<=285,675,675+(Press-285)/455*525)","v":2076.9230769230771},2388.4615384615386,2596.1538461538466,2700.0000000000005,"--",285,285,285,285,"--","Bckt & Cplgr","F10",16,null,null,null,2700.0000000000005]
["6.00",{"$f":"IF(Press<=285,2400,2400+(Press-285)/455*1375)","v":6071.7032967032965},6982.45879120879,7589.6291208791208,7893.2142857142853,"--",285,285,285,285,"--","Bckt & Cplgr","F10",20,null,null,null,7893.2142857142853]
["8.00",{"$f":"IF(Press<=285,4000,4000+(Press-285)/455*1600)","v":8272.5274725274721},9513.4065934065929,10340.65934065934,10754.285714285714,"--",285,285,285,285,"--","Bckt & Cplgr","F12",26,null,null,null,10754.285714285714]
["10.00",{"$f":"NA()","v":{"$error":"#N/A"}},{"$error":"#N/A"},{"$error":"#N/A"},{"$error":"#N/A"},"--","NA","NA","NA","NA","--","Bckt & Cplgr","--","--",null,null,null,{"$error":"#N/A"}]
["--","--","--","--","--","--","--","--","--","--","--","--","--","--"]
["PTFE originally from Virgo bulletin Floating HSV 2/2 copyright 2002; RPTFE = 1.15 PTFE, CRPTFE = 1.25 PTFE, UHMW-PE = 1.3 * PTFE"]
["Yellow shaded cells contain eqn. and / or logic statement.",null,null,null,"Torques revised 5/7/14"]
["10\" 5800R standard w/ Virgo GO & 23.6 in. D. Hwl."]
[null,null,null,null,"_5801F"]
["5801F Series Full Port",null,null,null,"_5800F",null,"Press =",{"$f":"Press","v":1500},"psi"]
[null,"Torque, lbf-in.",null,null,null,null,"Max. Seat Pressure",null,null,null,null,"Mounting"]
[null,"Teflon","RPTFE","CRPTFE","UHMW-PE","PEEK","T","R","S","U","P","Mount","Blt Ptrn","Sq",null,null,null,"UHMW-PE"]
["Size           Col.",2,3,4,5,6,7,8,9,10,11,10,11,12,null,null,null,"1.3 PTFE"]
["0.50",{"$f":"IF(Press<=285,55, 55+(Press-285)/455*45)","v":175.16483516483515},{"$f":"1.15*B105","v":201.43956043956041},{"$f":"1.25*B105","v":218.95604395604394},{"$f":"1.3*$B105","v":227.71428571428569},"--",285,285,285,285,"--","Bckt & Cplgr","F05",8,null,null,null,{"$f":"1.3*$B105","v":227.71428571428569}]
["0.75",{"$f":"IF(Press<=285,80, 80+(Press-285)/455*38)","v":181.47252747252747},{"$f":"1.15*B106","v":208.69340659340659},226.84065934065933,{"$f":"1.3*$B106","v":235.91428571428571},"--",285,285,285,285,"--","Bckt & Cplgr","F05",8,null,null,null,{"$f":"1.3*$B106","v":235.91428571428571}]
["1.00",{"$f":"IF(Press<=285,110, 110+(Press-285)/455*65)","v":283.57142857142856},326.10714285714283,354.46428571428567,368.64285714285711,"--",285,285,285,285,"--","Bckt & Cplgr","F07",10,null,null,null,368.64285714285711]
["1.50",{"$f":"IF(Press<=285,190, 190+(Press-285)/455*160)","v":617.25274725274721},709.84065934065927,771.56593406593402,802.42857142857144,"--",285,285,285,285,"--","Bckt & Cplgr","F07",14,null,null,null,802.42857142857144]
["2.00",{"$f":"IF(Press<=285,270, 270+(Press-285)/455*250)","v":937.58241758241752},1078.21978021978,1171.9780219780218,1218.8571428571429,"--",285,285,285,285,"--","Bckt & Cplgr","F07",14,null,null,null,1218.8571428571429]
["2.50",{"$f":"IF(Press<=285,400,400+(Press-285)/455*425)","v":1534.8901098901099},1765.1236263736262,1918.6126373626373,1995.3571428571429,"--",285,285,285,285,"--","Bckt & Cplgr","F07",14,null,null,null,1995.3571428571429]
["3.00",{"$f":"IF(Press<=285,675,675+(Press-285)/455*525)","v":2076.9230769230771},2388.4615384615386,2596.1538461538466,2700.0000000000005,"--",285,285,285,285,"--","Bckt & Cplgr","F10",16,null,null,null,2700.0000000000005]
["4.00",{"$f":"IF(Press<=285,1225,1225+(Press-285)/455*775)","v":3294.5054945054944},3788.6813186813183,4118.131868131868,4282.8571428571431,"--",285,285,285,285,"--","Bckt & Cplgr","F10",20,null,null,null,4282.8571428571431]
["6.00",{"$f":"IF(Press<=285,4000,4000+(Press-285)/455*1600)","v":8272.5274725274721},9513.4065934065929,10340.65934065934,10754.285714285714,"--",285,285,285,285,"--","Bckt & Cplgr","F12",26,null,null,null,10754.285714285714]
["8.00",{"$f":"IF(Press<=285,10000,10000+(Press-285)/455*2500)","v":16675.824175824175},19177.197802197799,20844.780219780219,21678.571428571428,"--",285,285,285,285,"--","Bckt & Cplgr","F14",32,null,null,null,21678.571428571428]
["--","--","--","--","--","--","--","--","--","--","--","--","--","--"]
["PTFE originally from Virgo bulletin Floating HSV 2/2 copyright 2002; RPTFE = 1.15 PTFE, CRPTFE = 1.25 PTFE, UHMW-PE = 1.3 * PTFE"]
["Yellow shaded cells contain eqn. and / or logic statement.",null,null,null,"Torques revised 5/7/14"]
["8\" 5800F standard w/ Virgo GO & 23.6 in. D. Hwl."]
[]
[]
["6800R Series Reduced Port",null,null,null,"_6800R",null,{"$f":"Press","v":1500},"psi"]
[null,"Torque, lbf-in.",null,null,null,null,"Max. Seat Pressure",null,null,null,null,"Mounting"]
[null,"Teflon","RPTFE","CRPTFE","UHMW-PE","PEEK","T","R","S","U","P","Mount","Blt Ptrn","Sq",null,null,null,"UHMW-PE"]
["Size           Col.",2,3,4,5,6,7,8,9,10,11,10,11,12,null,null,null,"1.3 PTFE"]
["0.50",{"$f":"NA()","v":{"$error":"#N/A"}},{"$f":"1.15*B125","v":{"$error":"#N/A"}},{"$f":"1.25*B125","v":{"$error":"#N/A"}},{"$f":"1.3*$B125","v":{"$error":"#N/A"}},"--",740,740,740,740,"--","Bckt & Cplgr","--","--",null,null,null,{"$f":"1.3*$B125","v":{"$error":"#N/A"}}]
["0.75",{"$f":"IF(Press<=285,44, 71)","v":71},{"$f":"1.15*B126","v":81.649999999999991},88.75,{"$f":"1.3*$B126","v":92.3},"--",740,740,740,740,"--","Bckt & Cplgr","--","--",null,null,null,{"$f":"1.3*$B126","v":92.3}]
["1.00",{"$f":"IF(Press<=285,71, 80)","v":80},92,100,104,"--",740,740,740,740,"--","Bckt & Cplgr","--","--",null,null,null,104]
["1.50",{"$f":"IF(Press<=285,106, 142)","v":142},163.29999999999998,177.5,184.6,"--",740,740,740,740,"--","Bckt & Cplgr","--","--",null,null,null,184.6]
["2.00",{"$f":"IF(Press<=285,221, 310)","v":310},356.5,387.5,403,"--",740,740,740,740,"--","Bckt & Cplgr","--","--",null,null,null,403]
["2.50",{"$f":"IF(Press<=285,266, 390)","v":390},448.49999999999994,487.5,507,"--",740,740,740,740,"--","Bckt & Cplgr","--","--",null,null,null,507]
["3.00",{"$f":"IF(Press<=285,407, 567)","v":567},652.04999999999995,708.75,737.1,"--",740,740,740,740,"--","Bckt & Cplgr","--","--",null,null,null,737.1]
["4.00",{"$f":"IF(Press<=285,620, 974)","v":974},1120.0999999999999,1217.5,1266.2,"--",740,740,740,740,"--","Bckt & Cplgr","--","--",null,null,null,1266.2]
["6.00",{"$f":"IF(Press<=285,1283, 1593)","v":1593},1831.9499999999998,1991.25,2070.9,"--",740,740,740,740,"--","Bckt & Cplgr","--","--",null,null,null,2070.9]
["8.00",{"$f":"IF(Press<=285,3098, 4868)","v":4868},5598.2,6085,6328.4000000000005,"--",740,740,740,740,"--","Bckt & Cplgr","--","--",null,null,null,6328.4000000000005]
["10.00",{"$f":"IF(Press<=285,7080, 8851)","v":8851},10178.65,11063.75,11506.300000000001,"--",740,740,740,740,"--","Bckt & Cplgr","--","--",null,null,null,11506.300000000001]
["--","--","--","--","--","--","--","--","--","--","--","--","--","--"]
["PTFE originally from Virgo bulletin Floating HSV 2/2 copyright 2002; RPTFE = 1.15 PTFE, CRPTFE = 1.25 PTFE, UHMW-PE = 1.3 * PTFE",null,null,null,null,null,null,null,null,"Torques changed to 5800 values below 285 psi.  JJH  2/4/06"]
["Yellow shaded cells contain eqn. and / or logic statement.",null,null,null,"Torques revised 5/7/14"]
["8\" & 10\" 6800R standard w/ Virgo GO."]
[null,null,null,null,"_6801F"]
["6801F Series Full Port",null,null,null,"_6800F",null,{"$f":"Press","v":1500},"psi"]
[null,"Torque, lbf-in.",null,null,null,null,"Max. Seat Pressure",null,null,null,null,"Mounting"]
[null,"Teflon","RPTFE","CRPTFE","UHMW-PE","PEEK","T","R","S","U","P","Mount","Blt Ptrn","Sq",null,null,null,"UHMW-PE"]
["Size           Col.",2,3,4,5,6,7,8,9,10,11,10,11,12,null,null,null,"1.3 PTFE"]
["0.50",{"$f":"IF(Press<=285,55, 55+(Press-285)/455*45)","v":175.16483516483515},{"$f":"1.15*B145","v":201.43956043956041},{"$f":"1.1*C145","v":221.58351648351646},{"$f":"1.3*$B145","v":227.71428571428569},"--",740,740,740,740,"--","Bckt & Cplgr","F05",8,null,null,null,{"$f":"1.3*$B145","v":227.71428571428569}]
["0.75",{"$f":"IF(Press<=285,80, 80+(Press-285)/455*38)","v":181.47252747252747},{"$f":"1.15*B146","v":208.69340659340659},{"$f":"1.25*B146","v":226.84065934065933},{"$f":"1.3*$B146","v":235.91428571428571},"--",740,740,740,740,"--","Bckt & Cplgr","F05",8,null,null,null,{"$f":"1.3*$B146","v":235.91428571428571}]
["1.00",{"$f":"IF(Press<=285,110, 110+(Press-285)/455*65)","v":283.57142857142856},326.10714285714283,354.46428571428567,368.64285714285711,"--",740,740,740,740,"--","Bckt & Cplgr","F07",10,null,null,null,368.64285714285711]
["1.50",{"$f":"IF(Press<=285,190, 190+(Press-285)/455*160)","v":617.25274725274721},709.84065934065927,771.56593406593402,802.42857142857144,"--",740,740,740,740,"--","Bckt & Cplgr","F07",14,null,null,null,802.42857142857144]
["2.00",{"$f":"IF(Press<=285,270, 270+(Press-285)/455*250)","v":937.58241758241752},1078.21978021978,1171.9780219780218,1218.8571428571429,"--",740,740,740,740,"--","Bckt & Cplgr","F07",14,null,null,null,1218.8571428571429]
["2.50",{"$f":"IF(Press<=285,400,400+(Press-285)/455*425)","v":1534.8901098901099},1765.1236263736262,1918.6126373626373,1995.3571428571429,"--",740,740,740,740,"--","Bckt & Cplgr","F07",14,null,null,null,1995.3571428571429]
["3.00",{"$f":"IF(Press<=285,675,675+(Press-285)/455*525)","v":2076.9230769230771},2388.4615384615386,2596.1538461538466,2700.0000000000005,"--",740,740,740,740,"--","Bckt & Cplgr","F10",16,null,null,null,2700.0000000000005]
["4.00",{"$f":"IF(Press<=285,1225,1225+(Press-285)/455*775)","v":3294.5054945054944},3788.6813186813183,4118.131868131868,4282.8571428571431,"--",740,740,740,740,"--","Bckt & Cplgr","F10",20,null,null,null,4282.8571428571431]
["6.00",{"$f":"IF(Press<=285,4000,4000+(Press-285)/455*1600)","v":8272.5274725274721},9513.4065934065929,10340.65934065934,10754.285714285714,"--",740,740,740,740,"--","Bckt & Cplgr","F12",26,null,null,null,10754.285714285714]
["8.00",{"$f":"IF(Press<=285,10000,10000+(Press-285)/455*2500)","v":16675.824175824175},19177.197802197799,20844.780219780219,21678.571428571428,"--",740,740,740,740,"--","Bckt & Cplgr","F14",32,null,null,null,21678.571428571428]
["--","--","--","--","--","--","--","--","--","--","--","--","--","--"]
["PTFE originally from Virgo bulletin Floating HSV 2/2 copyright 2002; RPTFE = 1.15 PTFE, CRPTFE = 1.25 PTFE, UHMW-PE = 1.3 * PTFE",null,null,null,null,null,null,null,null,"Torques changed to 5800 values below 285 psi.  JJH  2/4/06"]
["Yellow shaded cells contain eqn. and / or logic statement.",null,null,null,"Torques revised 5/7/14"]
["6\" & 8\"  6800F standard w/ Virgo GO & 23.6 in. D. Hwl."]

{"sheet":"8K","index":13,"n_rows":66,"n_cols":16,"rows_kept":66,"cut":false,"hidden":true,"merged":[[49,6,49,10],[28,6,28,10],[28,1,28,5],[49,1,49,5],[3,11,3,13],[3,1,3,5],[3,6,3,10],[28,11,28,13],[49,11,49,13]]}
[]
[]
["CF8901F Series Full (Tube) Port",null,null,null,"_CF8901F",null,"Press =",{"$f":"Press","v":1500},"psi"]
[null,"Torque (Break), lbf-in.",null,null,null,null,"Max. Seat Pressure",null,null,null,null,"Mounting"]
[null,"Teflon","RPTFE","Delrin","UHMW-PE","PEEK","T","R","D","U","P","Mount","Blt Ptrn","Sq",null,"Teflon"]
["Size           Col.",2,3,4,5,6,7,8,9,10,11,12,13,14,null,2]
["0.50",80,"--","--","--","--","NA","--","--","--","--","Bckt & Cplgr","F03",9,null,89]
["0.75",100,"--","--","--","--","NA","--","--","--","--","Bckt & Cplgr","F03",9,null,142]
["1.00",125,"--","--","--","--","NA","--","--","--","--","Bckt & Cplgr","F04",11,null,177]
["1.50",290,"--","--","--","--","NA","--","--","--","--","Bckt & Cplgr","F05",14,null,310]
["2.00",400,"--","--","--","--","NA","--","--","--","--","Bckt & Cplgr","F05",14,null,443]
["2.50",600,"--","--","--","--","NA","--","--","--","--","Bckt & Cplgr","F07",17,null,752]
["3.00",900,null,null,null,"--","NA","--","--","--","--","Bckt & Cplgr","F07",17,null,974]
["4.00",1300,"--","--","--","--","NA","--","--","--","--","Bckt & Cplgr","F10",22,null,1195]
["--","--","--","--","--","--","--","--","--","--","--","--","--","--",null,"--"]
["Sigma 301T/B-M-SL",null,null,null,null,null,null,null,null,null,null,null,null,null,null,"was John Valve JV9301NC ST"]
[]
[]
[]
[]
[]
[]
[]
[]
[]
[]
[]
["4700F Series Full Port",null,null,null,"_4700F",null,"Press =",{"$f":"Press","v":1500},"psi"]
["Size F.P.","Torque (Break), lbf-in.",null,null,null,null,"Max. Seat Pressure",null,null,null,null,"Mounting"]
[null,"Teflon","RPTFE","CRPTFE","UHMW-PE","PEEK","T","R","S","U","P","Mount","Blt Ptrn","Sq"]
[null,2,3,4,5,6,7,8,9,10,11,12,13,14]
["0.50",{"$f":"0.87*C32","v":39.15},45,{"$f":"1.09*C32","v":49.050000000000004},{"$f":"1.3*$B32","v":50.895000000000003},"--","NA","NA","NA","NA","--","Direct","F03/F04",9]
["0.75",{"$f":"0.87*C33","v":49.589999999999996},57,62.13,{"$f":"1.3*$B33","v":64.466999999999999},"--","NA","NA","NA","NA","--","Direct","F03/F04",9]
["1.00",113.1,130,141.70000000000002,147.03,"--","NA","NA","NA","NA","--","Direct","F04/F05",11]
["1.25",165.3,{"$f":"IF(Press<=1500, 190, 0.12*Press + 10)","v":190},207.10000000000002,214.89000000000001,"--",2000,2000,2000,2000,"--","Direct","F04/F05",11]
["1.50",304.5,{"$f":"IF(Press<=1250, 250, 0.4*Press-250)","v":350},381.5,395.85,"--",2000,2000,2000,2000,"--","Direct","F05/F07",14]
["2.00",689.25750000000005,{"$f":"IF(Press<=1275, 400, 1.7201*Press-1787.9)","v":792.25},863.55250000000001,896.03475000000014,"--",2000,2000,2000,2000,"--","Direct","F05/F07",14]
["2.50",717.75,{"$f":"IF(Press<=750, 600, 0.3*Press+375)","v":825},899.25000000000011,933.07500000000005,"--",1000,1000,1000,1000,"--","Direct","F07/F10",17]
["3.00",1022.25,{"$f":"IF(Press<=750, 800, 0.5*Press+425)","v":1175},1280.75,1328.925,"--",1000,1000,1000,1000,"--","Direct","F07/F10",17]
["4.00",1653,{"$f":"IF(Press<=750, 1450, 0.6*Press+1000)","v":1900},2071,2148.9,"--",1000,1000,1000,1000,"--","Direct","F07/F10",17]
["--","--","--","--","--","--","--","--","--","--","--","--","--","--"]
["Emico EA-309"]
["Torques adjusted from Emico published values based on Emico & Richards tests."]
["Blue shaded cells contain logic statement / torque equation."]
["Yellow shaded cells contain eqn. and / or logic statement."]
[]
[]
[]
["8700F Series Full Port",null,null,null,"_8700F",null,"Press =",{"$f":"Press","v":1500},"psi"]
["Size F.P.","Torque (Break), lbf-in.",null,null,null,null,"Max. Seat Pressure",null,null,null,null,"Mounting"]
[null,"Teflon","RPTFE","CRPTFE","UHMW-PE","PEEK","T","R","S","U","P","Mount","Blt Ptrn","Sq"]
[null,2,3,4,5,6,7,8,9,10,11,12,13,14]
["0.50",{"$f":"0.87*C53","v":39.15},45,{"$f":"1.09*C53","v":49.050000000000004},{"$f":"1.3*$B53","v":50.895000000000003},"--","NA","NA","NA","NA","--","Direct","F03/F04",9]
["0.75",{"$f":"0.87*C54","v":49.589999999999996},57,62.13,{"$f":"1.3*$B54","v":64.466999999999999},"--","NA","NA","NA","NA","--","Direct","F03/F04",9]
["1.00",113.1,130,141.70000000000002,147.03,"--","NA","NA","NA","NA","--","Direct","F04/F05",11]
["1.25",165.3,190,207.10000000000002,214.89000000000001,"--","NA","NA","NA","NA","--","Direct","F04/F05",11]
["1.50",217.5,250,272.5,282.75,"--","NA","NA","NA","NA","--","Direct","F05/F07",14]
["2.00",348,400,436.00000000000006,452.40000000000003,"--","NA","NA","NA","NA","--","Direct","F05/F07",14]
["2.50",717.75,{"$f":"IF(Press<=750, 600, 0.3*Press+375)","v":825},899.25000000000011,933.07500000000005,"--",1000,1000,1000,1000,"--","Direct","F07/F10",17]
["3.00",1022.25,{"$f":"IF(Press<=750, 800, 0.5*Press+425)","v":1175},1280.75,1328.925,"--",1000,1000,1000,1000,"--","Direct","F07/F10",17]
["4.00",1653,{"$f":"IF(Press<=750, 1450, 0.6*Press+1000)","v":1900},2071,2148.9,"--",1000,1000,1000,1000,"--","Direct","F07/F10",17]
["--","--","--","--","--","--","--","--","--","--","--","--","--","--"]
["Emico EA-307"]
["Torques adjusted from Emico published values based on Emico & Richards tests."]
["Blue shaded cells contain logic statement / torque equation."]
["Yellow shaded cells contain eqn. and / or logic statement."]

{"sheet":"9K","index":14,"n_rows":72,"n_cols":18,"rows_kept":72,"cut":false,"hidden":true,"merged":[[38,16,39,16],[38,17,39,17],[57,1,57,4],[57,5,57,8],[57,9,57,11],[3,9,3,11],[18,9,18,11],[37,9,37,11],[18,5,18,8],[3,1,3,4],[18,1,18,4],[37,1,37,4],[3,5,3,8],[37,5,37,8]]}
[]
[]
["9000R Series Reduced Port",null,null,null,"_9000R"]
[null,"Torque (Break), lbf-in.",null,null,null,"Max. Seat Pressure",null,null,null,"Mounting"]
[null,"T","RPTFE","D","P","T","R","D","P","Mount","Blt Ptrn","Sq"]
["Size           Col.",2,3,4,5,6,7,8,9,10,11,12]
["0.50","--",60,"--","--","--","NA","--","--","Bckt & Cplgr","Spl",5.21]
["0.75","--",85,"--","--","--","NA","--","--","Bckt & Cplgr","Spl",6.2]
["1.00","--",150,"--","--","--","NA","--","--","Bckt & Cplgr","Spl",6.2]
["1.25","--",190,"--","--","--","NA","--","--","Bckt & Cplgr","Spl",9.3000000000000007]
["1.50","--",220,"--","--","--","NA","--","--","Bckt & Cplgr","Spl",9.3000000000000007]
["2.00","--",290,"--","--","--","NA","--","--","Bckt & Cplgr","Spl",9.3000000000000007]
["--","--","--","--","--","--","--","--","--","--","--","--"]
["Die Erste EG-211R"]
["Torques agree w/ Bulletin 9000-0999 G."]
[]
[]
["9000F Series Full Port",null,null,null,"_9000F"]
[null,"Torque (Break), lbf-in.",null,null,null,"Max. Seat Pressure",null,null,null,"Mounting"]
[null,"T","RPTFE","D","P","T","R","D","P","Mount","Blt Ptrn","Sq"]
["Size           Col.",2,3,4,5,6,7,8,9,10,11,12]
["0.25","--",50,"--","--","--","NA","--","--","Bckt & Cplgr","Spl",4]
["0.38","--",50,null,null,"--","NA","--","--","Bckt & Cplgr","Spl",5]
["0.50","--",85,"--","--","--","NA","--","--","Bckt & Cplgr","Spl",5]
["0.75","--",140,"--","--","--","NA","--","--","Bckt & Cplgr","Spl",5]
["1.00","--",180,"--","--","--","NA","--","--","Bckt & Cplgr","Spl",8]
["1.25","--",235,"--","--","--","NA","--","--","Bckt & Cplgr","Spl",8]
["1.50","--",300,"--","--","--","NA","--","--","Bckt & Cplgr","Spl",10]
["2.00","--",330,"--","--","--","NA","--","--","Bckt & Cplgr","Spl",10]
["2.50","--",850,"--","--","--","NA","--","--","Bckt & Cplgr","Spl",10]
["3.00","--",1200,"--","--","--","NA","--","--","Bckt & Cplgr","Spl",12]
["--","--","--","--","--","--","--","--","--","--","--","--"]
["Die Erste EG-211F"]
["Torques agree w/ Bulletin 9000-0999 G."]
[]
[]
["DM9000 Series Full Port",null,null,null,"_DM9000F"]
[null,"Torque (Break), lbf-in.",null,null,null,"Max. Seat Pressure",null,null,null,"Mounting"]
[null,"Teflon","RPTFE","Delrin","PEEK","T","R","D","P","Mount","Blt Ptrn","Sq",null,null,null,null,"Old Marwin Torq.","New Valbia Torq"]
["Size           Col.",2,3,4,5,6,7,8,9,10,11,12,null,"_DM9000F"]
["0.25",38,"--","--","--","NA","--","--","--","Direct","F03",9,null,"0.25",38,null,38,"2003-07-22"]
["0.38",38,"--","--","--","NA","--","--","--","Direct","F03",9,null,"0.38",38,null,38]
["0.50",38,"--","--","--","NA","--","--","--","Direct","F03",9,null,"0.50",38,null,38,53]
["0.75",45,"--","--","--","NA","--","--","--","Direct","F03",9,null,"0.75",45,null,45,53]
["1.00",53,"--","--","--","NA","--","--","--","Direct","F03",9,null,"1.00",53,null,53,53]
["1.25",66,"--","--","--","NA","--","--","--","Direct","F03",9,null,"1.25",66,null,66,53]
["1.50",90,"--","--","--","NA","--","--","--","Direct","F05",11,null,"1.50",90,null,90,150]
["2.00",150,"--","--","--","NA","--","--","--","Direct","F05",11,null,"2.00",150,null,120,150]
["--","--","--","--","--","--","--","--","--","--","--","--"]
["--","--","--","--","--","--","--","--","--","--","--","--"]
["--","--","--","--","--","--","--","--","--","--","--","--"]
["Valbia"]
["Old Marwin torques agree w/ Bulletin DM9000-1100 G."]
["New torques as follows 8/1/03:  0.5 - 1\" -- old torq. Used; 1.25\" new torq used; 1.5\" old torq. Used; 2\" new torq used.  Ref. Valbia e-mail dated 7/22/03 for new torques."]
[]
[]
["9700 Series 2-Pc Seal Welded",null,null,null,"_9700"]
[null,"Torque (Break), lbf-in.",null,null,null,"Max. Seat Pressure",null,null,null,"Mounting"]
[null,"Teflon","RPTFE","Delrin","PEEK","T","R","D","P","Mount","Blt Ptrn","Sq"]
["Size           Col.",2,3,4,5,6,7,8,9,10,11,12]
["0.25F",null,"--",89,"--","--","--","NA","--","Bckt & Cplgr","F03",6]
["0.38F",null,"--",89,"--","--","--","NA","--","Bckt & Cplgr","F03",6]
["0.50F",null,"--",89,"--","--","--","NA","--","Bckt & Cplgr","F03",6]
["0.75F",null,"--",117,"--","--","--","NA","--","Bckt & Cplgr","F04",8]
["1.00F",null,"--",336,"--","--","--","NA","--","Bckt & Cplgr","F05",8]
["1.25F",null,"--",797,"--","--","--","NA","--","Bckt & Cplgr","F07",12]
["1.50F",null,"--",850,"--","--","--","NA","--","Bckt & Cplgr","F07",12]
["2.00R",null,"--",850,"--","--","--","NA","--","Bckt & Cplgr","F07",12]
["--","--","--","--","--","--","--","--","--","--","--","--"]
["--","--","--","--","--","--","--","--","--","--","--","--"]
["--","--","--","--","--","--","--","--","--","--","--","--"]
["Die Erste FSB-26"]

{"sheet":"3W-2000","index":15,"n_rows":38,"n_cols":14,"rows_kept":38,"cut":false,"hidden":true,"merged":[[23,1,23,4],[3,1,3,4],[3,5,3,8],[23,5,23,8],[3,9,3,11],[23,9,23,11]]}
[]
[]
["3L/T-2100 Series Full Port Thd End Float Ball (Bolted End Pc)",null,null,null,null,null,"_3L_or_3T_2100F_A",null,null,"Press =",{"$f":"Press","v":1500},"psi"]
[null,"Torque (Break), lbf-in.",null,null,null,"Max. Seat Pressure",null,null,null,"Mounting",null,null,null,"3W-2P/Q33"]
[null,"Teflon","RPTFE","CRPTFE","UHMW-PE","T","R","S","U","Mount","Blt Ptrn","Sq",null,"RPTFE"]
["Size           Col.",2,3,4,5,6,7,8,9,10,11,12,null,3]
["0.38","--",95,{"$f":"1.15*$C7","v":109.24999999999999},{"$f":"1.15*$C7","v":109.24999999999999},"--","NA","NA","NA","--","--","--",null,95]
["0.50","--",{"$f":"IF(Press<=285, 147,206)","v":206},{"$f":"1.15*$C8","v":236.89999999999998},236.89999999999998,"--",740,"NA","NA","Direct","F04",9,null,150]
["0.75","--",{"$f":"IF(Press<=285, 177,249)","v":249},286.34999999999997,286.34999999999997,"--",740,"NA","NA","Direct","F05",11,null,220]
["1.00","--",{"$f":"IF(Press<=285, 288,394)","v":394},453.09999999999997,453.09999999999997,"--",740,"NA","NA","Direct","F05",11,null,354]
["1.25","--",{"$f":"IF(Press<=285, 398,557)","v":557},640.54999999999995,640.54999999999995,"--",740,"NA","NA","Direct","F05/F07",14,null,664]
["1.50","--",{"$f":"IF(Press<=285, 636,890)","v":890},1023.4999999999999,1023.4999999999999,"--",740,"NA","NA","Direct","F05/F07",14,null,858]
["2.00","--",{"$f":"IF(Press<=285, 826,1157)","v":1157},{"$f":"1.15*$C13","v":1330.55},1330.55,"--",740,"NA","NA","Direct","F07/F10",17,null,1717]
["2.50","--",{"$f":"IF(Press<=285, 1550,2170)","v":2170},2495.5,2495.5,"--",600,"NA","NA","Direct","F07/F10",17,null,2434]
["3.00","--",{"$f":"IF(Press<=285, 1698,2376)","v":2376},2732.3999999999996,2732.3999999999996,"--",600,"NA","NA","Direct","F07/F10",17,null,2726]
["4.00","--",{"$f":"IF(Press<=285, 2730,3823)","v":3823},4396.45,4396.45,"--",600,"NA","NA","Direct","F12",27,null,2921]
["6.00","--",{"$f":"IF(Press<=285, 147,206)","v":206},236.89999999999998,236.89999999999998,"--","NA","NA","NA","Bckt & Cplgr","F14",36,null,8100]
["--","--","--","--","--","--","--","--","--","--","--","--",null,"Taiwan Valve 30M"]
["DieErste Series M4 (Threaded).  Torques from Die Erste 4/30/13.",null,null,null,null,null,null,null,null,null,null,null,null,"Agrees w/ Taiwan Valve TI-9907-1.0"]
[]
[]
[]
["3L/T-2100 Series Full Port FE150 Float Ball (Bolted End Pc)",null,null,null,null,null,"_3L or 3T_2100F_F",null,null,"Press =",{"$f":"Press","v":1500},"psi"]
[null,"Torque (Break), lbf-in.",null,null,null,"Max. Seat Pressure",null,null,null,"Mounting"]
[null,"Teflon","RPTFE","CRPTFE","UHMW-PE","T","R","S","U","Mount","Blt Ptrn","Sq"]
["Size           Col.",2,3,4,5,6,7,8,9,10,11,12]
["0.50","--",147,{"$f":"1.15*$C27","v":169.04999999999998},169.04999999999998,"--","--","NA","NA","Direct","F04",9]
["0.75","--",177,203.54999999999998,203.54999999999998,"--","--","NA","NA","Direct","F05",11]
["1.00","--",288,331.2,331.2,"--","--","NA","NA","Direct","F05",11]
["1.25","--",398,457.7,457.7,"--","--","NA","NA","Direct","F05/F07",14]
["1.50","--",636,731.4,731.4,"--","--","NA","NA","Direct","F05/F07",14]
["2.00","--",826,949.9,949.9,"--","--","NA","NA","Direct","F07/F10",17]
["2.50","--",1550,1782.4999999999998,1782.4999999999998,"--","--","NA","NA","Direct","F07/F10",17]
["3.00","--",1698,1952.6999999999998,1952.6999999999998,"--","--","NA","NA","Direct","F07/F10",17]
["4.00","--",2730,3139.4999999999995,3139.4999999999995,"--","--","NA","NA","Direct","F12",27]
["6.00","--",5603,6443.45,6443.45,"--","--","NA","NA","Bckt & Cplgr","F14",36]
["--","--","--","--","--","--","--","--","--","--","--","--"]
["DieErste Series M4F (Flanged).  Torques from Die Erste 4/30/13."]

{"sheet":"3T31-3L32","index":16,"n_rows":20,"n_cols":15,"rows_kept":20,"cut":false,"hidden":true,"merged":[[3,1,3,4],[3,5,3,8],[3,9,3,11]]}
[]
[]
["3T3101 or 3L3201 Series Full Port",null,null,"_3T3101F","_3L3201F"]
[null,"Torque (Break), lbf-in.",null,null,null,"Max. Seat Pressure",null,null,null,"Mounting"]
[null,"Teflon","RPTFE","Delrin","PEEK","T","R","D","P","Mount","Blt Ptrn","Sq",null,null,"New Dsgn"]
["Size           Col.",2,3,4,5,6,7,8,9,10,11,12,null,null,"TFE*"]
["0.25",18,"--","--","--","NA","--","--","--","Direct","F03",9,null,null,71]
["0.38",18,"--","--","--","NA","--","--","--","Direct","F03",9,null,null,71]
["0.50",45,"--","--","--","NA","--","--","--","Direct","F03",9,null,null,71]
["0.75",89,"--","--","--","NA","--","--","--","Direct","F03",9,null,null,71]
["1.00",133,"--","--","--","NA","--","--","--","Direct","F05",9,null,null,71]
["1.25",178,"--","--","--","NA","--","--","--","Direct","F05",9,null,null,160]
["1.50",239,"--","--","--","NA","--","--","--","Direct","F05",11,null,null,160]
["2.00",284,"--","--","--","NA","--","--","--","Direct","F07",11,null,null,160]
["3.00",974,"--","--","--","NA","--","--","--","None","--","--"]
["--","--","--","--","--","--","--","--","--","--","--","--"]
["1/4\"-2\" 3T3101/3L3201 (Valbia 3T3210 / 3L3110)",null,null,null,null,null,null,null,null,null,null,null,null,null,"*New desing (O-ring loaded seats, O-ring stem"]
["3\" 3T-3100/3L-3200 (Valbia 3210 / 3110); torques from e-mail, C. Cancarini (Valbia) to C. Page, 10/31/00.",null,null,null,null,null,null,null,null,null,null,null,null,null,"seal, ISO pad).  Maximum torque (safety factor"]
[null,null,null,null,null,null,null,null,null,null,null,null,null,null,"included) per G. Crescini 9/11/06 e-mail to C."]
[null,null,null,null,null,null,null,null,null,null,null,null,null,null,"Bechtel"]

{"sheet":"3T33-3L34","index":17,"n_rows":18,"n_cols":12,"rows_kept":18,"cut":false,"hidden":true,"merged":[[3,1,3,4],[3,5,3,8],[3,9,3,11]]}
[]
[]
["3T3300 and 3L3400 Series Reduced Port",null,null,null,null,"_3T3300R   _3L3400R"]
[null,"Torque (Break), lbf-in.",null,null,null,"Max. Seat Pressure",null,null,null,"Mounting"]
[null,"Teflon","RPTFE","Delrin","PEEK","T","R","D","P","Mount","Blt Ptrn","Sq"]
["Size           Col.",2,3,4,5,6,7,8,9,10,11,12]
["0.25","--",53.1,"--","--","--","NA","--","--","Direct","F03",9]
["0.38","--",53.1,"--","--","--","NA","--","--","Direct","F03",9]
["0.50","--",53.1,"--","--","--","NA","--","--","Direct","F03",9]
["0.75","--",53.1,"--","--","--","NA","--","--","Direct","F03",9]
["1.00","--",150.5,"--","--","--","NA","--","--","Direct","F05",11]
["1.25","--",150.5,"--","--","--","NA","--","--","Direct","F05",11]
["1.50","--",150.5,"--","--","--","NA","--","--","Direct","F05",11]
["2.00","--",274.39999999999998,"--","--","--","NA","--","--","Direct","F07",14]
["--","--","--","--","--","--","--","--","--","--","--","--"]
["--","--","--","--","--","--","--","--","--","--","--","--"]
["No Torques in Bulletin 3300-0900 G"]
["Valbia 355N / 365N.  Torques from Istruzione I-010.3/13 attached to e-mail, C. Cancarini (Valbia) to C. Page, 10/31/00."]

{"sheet":"3T37-3L38","index":18,"n_rows":18,"n_cols":12,"rows_kept":18,"cut":false,"hidden":true,"merged":[[3,1,3,4],[3,5,3,8],[3,9,3,11]]}
[]
[]
["3T3700 and 3L3800 Series Standard (Reduced) Port",null,null,null,null,"_3T3700R   _3L3800R"]
[null,"Torque (Break), lbf-in.",null,null,null,"Max. Seat Pressure",null,null,null,"Mounting"]
[null,"Teflon","RPTFE","Delrin","PEEK","T","R","D","P","Mount","Blt Ptrn","Sq"]
["Size           Col.",2,3,4,5,6,7,8,9,10,11,12]
["0.25",93,93,"--","--","NA","NA","--","--","Bckt & Cplgr","F04",9]
["0.38",93,93,"--","--","NA","NA","--","--","Bckt & Cplgr","F04",9]
["0.50",100,100,"--","--","NA","NA","--","--","Bckt & Cplgr","F04",9]
["0.75",150,150,"--","--","NA","NA","--","--","Bckt & Cplgr","F05",11]
["1.00",300,300,"--","--","NA","NA","--","--","Bckt & Cplgr","F05",11]
["1.25",385,385,"--","--","NA","NA","--","--","Bckt & Cplgr","F05",11]
["1.50",450,450,"--","--","NA","NA","--","--","Bckt & Cplgr","F07",11]
["2.00",580,580,"--","--","NA","NA","--","--","Bckt & Cplgr","F07",14]
["--","--","--","--","--","--","--","--","--","--","--","--"]
["Die Erste EGTS-45"]
["Agrees w/ Bulletin w/ 3L3800-0100 G"]
["0.25 & 0.38 RPTFE Torque 93 was 100-Changed so UT-1-SR-80 FC selected w/ 1.2 SF based on customer experience.  JJH  11/4/04"]